program: Orca
programVersion: 5.0.2
elementType: O O O O N N C C C C C C C C C C C C C C C C C H H H H H H H H H H H H H H H H H H H H H H
charge: 0
multiplicity: 1
keywords: wb97x-d3
keywords: def2-TZVPP
keywords: def2/J RIJCOSX
keywords: DEFGRID2
keywords: scfconv7
keywords: smallprint printgap noloewdin
keywords: NOSOSCF
formula: C17H22N2O4
InChI: InChI=1/C17H22N2O4/c1-6-7-18-9-13(20)19(16(18)22)10-23-15(21)14-12(8-11(2)3)17(14,4)5/h1,8,12,14H,7,9-10H2,2-5H3
45 atoms
O  0.111531 0.179413 0.0120
O  2.037993 1.248746 0.35854
O  -2.490714 0.052219 2.214652
O  -2.119407 1.871056 -1.941873
N  -1.980329 1.097554 0.233577
N  -3.951471 1.104763 -0.76998
C  3.312095 -1.148762 -1.211718
C  3.343674 -1.540465 0.22203
C  2.035315 -1.035803 -0.39291
C  3.294942 -2.2577 -2.236953
C  4.047306 0.079088 -1.687856
C  4.105674 -0.77363 1.23948
C  1.451867 0.244345 0.024109
C  3.770007 -0.662739 2.526982
C  4.628579 0.090602 3.495311
C  2.519356 -1.246714 3.105464
C  -0.591584 1.340951 0.436591
C  -2.806701 0.462703 1.12482
C  -2.646946 1.402978 -0.957569
C  -4.15684 0.389689 0.467844
C  -4.877499 0.993683 -1.872871
C  -4.858371 -0.330427 -2.48988
C  -4.857547 -1.426182 -2.982286
H  3.301631 -2.610958 0.406546
H  1.298049 -1.8043 -0.591809
H  2.796854 -1.936648 -3.153543
H  4.313592 -2.551753 -2.496956
H  2.777686 -3.1437 -1.867393
H  3.559196 0.501524 -2.567726
H  4.130201 0.865941 -0.943434
H  5.06149 -0.199536 -1.980131
H  5.025307 -0.301958 0.904772
H  5.527054 0.489224 3.024918
H  4.078011 0.925746 3.935898
H  4.936536 -0.548112 4.326877
H  1.875287 -0.456154 3.499829
H  1.939196 -1.822839 2.387048
H  2.752957 -1.900539 3.949396
H  -0.413596 1.534919 1.494087
H  -0.29645 2.216379 -0.139744
H  -4.433023 -0.656062 0.302918
H  -4.921677 0.853541 1.092911
H  -4.642684 1.758519 -2.612615
H  -5.881101 1.215695 -1.508476
H  -4.8358 -2.395053 -3.428941
elementType: O N C H
totalener: -1071.53837279 hartree
nucrepener: 1935.96618104 hartree
electener: -3007.50455383 hartree
oneelecener: -5304.84852733 hartree
twoeener: 2297.34397351 hartree
cpcmener: -0.05100336 hartree
kineticenergy: 1066.86408347 hartree
xcener: -102.623908492590 hartree
chargesum: 0.0000000
charge: -0.286387 -0.491440 -0.473386 -0.509910 -0.125451 -0.172402 0.133221 -0.011252 -0.092368 -0.264929 -0.298096 -0.286196 0.409062 -0.019484 -0.222960 -0.265263 0.080403 0.320077 0.408301 -0.000252 -0.042060 -0.434381 0.058035 0.117468 0.096412 0.096846 0.093877 0.088437 0.102759 0.094135 0.100451 0.125035 0.089528 0.094927 0.095734 0.099017 0.093407 0.107654 0.138779 0.130788 0.128742 0.127264 0.135884 0.141791 0.288180
qa: -0.2864 -0.4914 -0.4734 -0.5099 -0.1255 -0.1724 0.1332 -0.0113 -0.0924 -0.2649 -0.2981 -0.2862 0.4091 -0.0195 -0.2230 -0.2653 0.0804 0.3201 0.4083 -0.0003 -0.0421 -0.4344 0.0580 0.1175 0.0964 0.0968 0.0939 0.0884 0.1028 0.0941 0.1005 0.1250 0.0895 0.0949 0.0957 0.0990 0.0934 0.1077 0.1388 0.1308 0.1287 0.1273 0.1359 0.1418 0.2882
va: 2.1015 1.9897 2.0376 2.0065 3.1579 3.1928 3.7329 3.8166 3.8532 3.9023 3.8964 3.8523 4.0411 3.7071 3.9239 3.9426 3.8945 4.1656 4.2880 3.9041 3.9005 3.7437 3.5851 1.0050 1.0286 1.0021 1.0022 1.0046 1.0003 1.0138 0.9981 0.9997 1.0068 0.9966 0.9968 0.9986 1.0062 0.9994 0.9980 1.0060 1.0054 1.0084 1.0017 0.9866 0.9448
dispcorr: -0.021120190 hartree
energy: -1071.559492975154
dipole: 26.25824 -28.14838 -1.89014 -9.89594 8.78161 -1.11433 4.27556 -4.47495 -0.19939
magnitude: 2.20321 au
magnitude: 5.60012 debye
