program: Orca
programVersion: 5.0.2
elementType: O O O O N N C C C C C C C C C C C C C C C C C H H H H H H H H H H H H H H H H H H H H H H
charge: 0
multiplicity: 1
keywords: wb97x-d3
keywords: def2-TZVPP
keywords: def2/J RIJCOSX
keywords: DEFGRID2
keywords: scfconv7
keywords: smallprint printgap noloewdin
keywords: NOSOSCF
formula: C17H22N2O4
InChI: InChI=1/C17H22N2O4/c1-6-7-18-9-13(20)19(16(18)22)10-23-15(21)14-12(8-11(2)3)17(14,4)5/h1,8,12,14H,7,9-10H2,2-5H3
45 atoms
O  0.880485 1.713888 -0.989795
O  1.202293 1.005551 1.104522
O  -1.473153 2.114519 2.055112
O  -1.826945 0.920597 -2.332744
N  -1.360584 1.720397 -0.21357
N  -3.134805 0.431384 -0.496346
C  3.895428 -0.158087 0.116694
C  2.894768 -1.194124 -0.246044
C  2.65723 0.26818 -0.655135
C  5.16801 -0.119849 -0.697615
C  4.118349 0.245782 1.553149
C  2.016722 -1.860883 0.745712
C  1.543509 1.00743 -0.053711
C  0.821616 -2.375432 0.443763
C  -0.043879 -3.015257 1.484098
C  0.236988 -2.29276 -0.934134
C  -0.216803 2.506524 -0.575049
C  -1.871894 1.576399 1.051465
C  -2.096246 0.988521 -1.152407
C  -3.036917 0.633977 0.92728
C  -3.997721 -0.570775 -1.073442
C  -3.603173 -1.931089 -0.715365
C  -3.273574 -3.040503 -0.39339
H  3.153512 -1.80618 -1.106427
H  2.813948 0.483275 -1.705165
H  5.604433 0.880514 -0.691853
H  5.906692 -0.807757 -0.281831
H  4.997109 -0.404634 -1.736515
H  4.905908 -0.378427 1.979653
H  4.456964 1.281453 1.611255
H  3.244741 0.145628 2.189881
H  2.371998 -1.927268 1.769418
H  -0.291239 -4.045365 1.215783
H  0.430229 -3.023361 2.465441
H  -0.995632 -2.483063 1.574006
H  0.99245 -2.173755 -1.709919
H  -0.347796 -3.184079 -1.168491
H  -0.445499 -1.441446 -1.011548
H  0.041175 3.149646 0.265027
H  -0.456279 3.131874 -1.430927
H  -2.817134 -0.294118 1.465254
H  -3.943294 1.071621 1.348696
H  -4.000115 -0.452546 -2.156866
H  -5.021085 -0.38968 -0.740289
H  -2.973994 -4.030804 -0.12911
elementType: O N C H
totalener: -1071.53846364 hartree
nucrepener: 2066.08588428 hartree
electener: -3137.62434792 hartree
oneelecener: -5565.35552481 hartree
twoeener: 2427.73117689 hartree
cpcmener: -0.05527880 hartree
kineticenergy: 1066.86588397 hartree
xcener: -102.629089394374 hartree
chargesum: 0.0000000
charge: -0.289100 -0.483785 -0.472978 -0.513360 -0.100419 -0.134270 0.131125 -0.009240 -0.119291 -0.264493 -0.294324 -0.279455 0.427435 0.034752 -0.245613 -0.313037 0.063926 0.321126 0.356332 -0.012132 -0.024117 -0.401404 0.011461 0.112295 0.093400 0.096383 0.095508 0.087890 0.099990 0.102012 0.092151 0.127253 0.101059 0.096945 0.085637 0.110525 0.109467 0.089666 0.135435 0.152120 0.129756 0.129276 0.133313 0.142981 0.287797
qa: -0.2891 -0.4838 -0.4730 -0.5134 -0.1004 -0.1343 0.1311 -0.0092 -0.1193 -0.2645 -0.2943 -0.2795 0.4274 0.0348 -0.2456 -0.3130 0.0639 0.3211 0.3563 -0.0121 -0.0241 -0.4014 0.0115 0.1123 0.0934 0.0964 0.0955 0.0879 0.1000 0.1020 0.0922 0.1273 0.1011 0.0969 0.0856 0.1105 0.1095 0.0897 0.1354 0.1521 0.1298 0.1293 0.1333 0.1430 0.2878
va: 2.1046 2.0073 2.0360 1.9921 3.0927 3.1990 3.7592 3.8080 3.8480 3.8997 3.8907 3.8412 4.0537 3.6177 3.9374 3.9754 3.9007 4.1728 4.3158 3.9012 3.8809 3.7172 3.6337 1.0063 1.0313 1.0024 1.0019 1.0044 0.9984 1.0002 1.0169 1.0011 0.9949 1.0121 0.9894 1.0089 0.9969 0.9854 1.0163 0.9961 0.9977 1.0101 1.0052 0.9859 0.9472
dispcorr: -0.026190401 hartree
energy: -1071.564654040433
dipole: 16.62911 -17.59251 -0.96340 -15.13261 14.17046 -0.96216 2.70483 -3.26181 -0.55698
magnitude: 1.47109 au
magnitude: 3.73922 debye
