program: Orca
programVersion: 5.0.2
elementType: O O O O N N C C C C C C C C C C C C C C C C C H H H H H H H H H H H H H H H H H H H H H H
charge: 0
multiplicity: 1
keywords: wb97x-d3
keywords: def2-TZVPP
keywords: def2/J RIJCOSX
keywords: DEFGRID2
keywords: scfconv7
keywords: smallprint printgap noloewdin
keywords: NOSOSCF
formula: C17H22N2O4
InChI: InChI=1/C17H22N2O4/c1-6-7-18-9-13(20)19(16(18)22)10-23-15(21)14-12(8-11(2)3)17(14,4)5/h1,8,12,14H,7,9-10H2,2-5H3
45 atoms
O  0.893144 1.078028 -0.43893
O  2.381284 2.247972 -1.606366
O  -1.021553 2.494324 1.881013
O  -2.078548 0.159282 -1.880222
N  -1.326145 1.551046 -0.190264
N  -3.197051 0.421354 0.119521
C  3.348755 -0.057378 1.041141
C  2.869505 -1.067909 0.059346
C  3.143261 0.361801 -0.409178
C  4.794248 -0.131681 1.472805
C  2.440321 0.443265 2.137223
C  1.520604 -1.679507 0.123825
C  2.126094 1.315795 -0.872089
C  0.915231 -2.251912 -0.919029
C  -0.405498 -2.941282 -0.776672
C  1.530086 -2.252835 -2.289734
C  -0.127015 1.993638 -0.817825
C  -1.649322 1.800349 1.118748
C  -2.206284 0.629368 -0.770189
C  -2.916725 1.040708 1.392499
C  -4.196045 -0.607936 -0.035238
C  -3.837321 -1.84865 0.647509
C  -3.547274 -2.86133 1.225288
H  3.638282 -1.74263 -0.31074
H  4.06311 0.489181 -0.967795
H  5.165205 0.849323 1.774735
H  4.90146 -0.80399 2.326281
H  5.438792 -0.502583 0.675209
H  2.568496 -0.181371 3.023321
H  2.70629 1.463781 2.418019
H  1.382956 0.432289 1.887471
H  1.029796 -1.704301 1.092182
H  -1.159551 -2.486229 -1.423179
H  -0.334256 -3.988961 -1.081516
H  -0.773442 -2.913268 0.248599
H  2.329314 -2.995134 -2.367712
H  0.794506 -2.495112 -3.057145
H  1.970034 -1.286213 -2.542898
H  0.105039 3.002636 -0.479054
H  -0.267363 2.002505 -1.897552
H  -2.746224 0.306107 2.184685
H  -3.715463 1.713102 1.711644
H  -4.350318 -0.794153 -1.09787
H  -5.145564 -0.237943 0.354946
H  -3.294591 -3.762405 1.738333
elementType: O N C H
totalener: -1071.53531592 hartree
nucrepener: 2055.01937048 hartree
electener: -3126.55468641 hartree
oneelecener: -5542.53557204 hartree
twoeener: 2415.98088564 hartree
cpcmener: -0.05060909 hartree
kineticenergy: 1066.87237366 hartree
xcener: -102.627697245495 hartree
chargesum: 0.0000000
charge: -0.251974 -0.502473 -0.474739 -0.513841 -0.109600 -0.143652 0.132501 -0.024327 -0.134434 -0.269659 -0.284229 -0.232698 0.433736 -0.048961 -0.232324 -0.276427 0.054560 0.306879 0.382810 0.015030 -0.040541 -0.429270 0.045164 0.116948 0.095947 0.096668 0.094221 0.088653 0.102370 0.105629 0.075060 0.128579 0.086479 0.114309 0.084299 0.108167 0.097606 0.097363 0.140979 0.138174 0.129474 0.127252 0.134555 0.143980 0.291758
qa: -0.2520 -0.5025 -0.4747 -0.5138 -0.1096 -0.1437 0.1325 -0.0243 -0.1344 -0.2697 -0.2842 -0.2327 0.4337 -0.0490 -0.2323 -0.2764 0.0546 0.3069 0.3828 0.0150 -0.0405 -0.4293 0.0452 0.1169 0.0959 0.0967 0.0942 0.0887 0.1024 0.1056 0.0751 0.1286 0.0865 0.1143 0.0843 0.1082 0.0976 0.0974 0.1410 0.1382 0.1295 0.1273 0.1346 0.1440 0.2918
va: 2.1091 1.9957 2.0296 1.9933 3.1643 3.2067 3.7456 3.7896 3.8874 3.9062 3.9157 3.7661 4.0673 3.7059 3.9064 3.9512 3.9059 4.1592 4.2964 3.9034 3.8917 3.7400 3.5924 1.0018 1.0288 1.0014 1.0019 1.0052 1.0001 1.0005 1.0070 0.9963 1.0046 0.9958 1.0053 0.9966 1.0037 0.9987 1.0006 1.0057 1.0051 1.0064 1.0031 0.9862 0.9434
dispcorr: -0.025607741 hartree
energy: -1071.560923662070
dipole: 13.43048 -15.17863 -1.74815 -15.22380 13.76271 -1.46109 4.01602 -2.50291 1.51311
magnitude: 2.73502 au
magnitude: 6.95187 debye
