program: Orca
programVersion: 5.0.2
elementType: S O O O O C C C C C C C C C C C C C C C C C C C C C C C H H H H H H H H H H H H H H H H H H H H H H H H
charge: 0
multiplicity: 1
keywords: wb97x-d3
keywords: def2-TZVPP
keywords: def2/J RIJCOSX
keywords: DEFGRID2
keywords: scfconv7
keywords: smallprint printgap noloewdin
keywords: NOSOSCF
formula: C23H24O4S
InChI: InChI=1/C23H24O4S/c1-23(2)19(12-17-8-9-28-22(17)25)20(23)21(24)27-14-16-11-18(26-13-16)10-15-6-4-3-5-7-15/h3-7,11-13,19-20H,8-10,14H2,1-2H3
52 atoms
S  -0.004947 1.499359 -3.682957
O  2.304213 1.389287 0.659493
O  1.845818 0.33225 2.582406
O  -1.236186 -0.41993 -2.364957
O  -1.793965 2.448469 -0.618024
C  2.575896 -2.21398 0.961603
C  2.497007 -1.502977 -0.36651
C  3.056179 -0.803093 0.860435
C  1.303231 -2.545477 1.70391
C  3.638229 -3.278363 1.101861
C  1.214857 -1.078615 -0.962609
C  2.326191 0.34048 1.483088
C  1.131313 -0.220574 -1.979524
C  2.261679 0.490194 -2.648887
C  -0.186967 0.127385 -2.562142
C  1.712183 1.812184 -3.184196
C  1.475265 2.504593 1.021267
C  0.080945 2.284142 0.555587
C  -0.845474 1.292458 1.013755
C  -0.558001 2.945769 -0.43794
C  -1.958172 1.433014 0.256593
C  -3.247986 0.691691 0.215303
C  -3.184131 -0.538541 1.079334
C  -3.578324 -0.494081 2.411096
C  -2.682514 -1.731834 0.567439
C  -3.475082 -1.617478 3.219213
C  -2.581913 -2.85676 1.371723
C  -2.976733 -2.802753 2.701134
H  3.252627 -1.775735 -1.098174
H  4.132738 -0.65152 0.851093
H  0.913164 -3.502769 1.353078
H  1.497962 -2.63284 2.77243
H  0.509687 -1.810326 1.588248
H  3.277221 -4.238137 0.728973
H  4.543995 -3.028495 0.546832
H  3.917983 -3.410489 2.148196
H  0.291969 -1.484971 -0.562132
H  2.639787 -0.110743 -3.481665
H  3.091575 0.671745 -1.966171
H  2.275453 2.17971 -4.039656
H  1.721839 2.576298 -2.40683
H  1.518603 2.674216 2.097893
H  1.918126 3.36712 0.523234
H  -0.699699 0.57563 1.804142
H  -0.270513 3.767395 -1.074503
H  -4.066295 1.341378 0.542244
H  -3.46638 0.415631 -0.81938
H  -3.967195 0.429909 2.82269
H  -2.366902 -1.773808 -0.467607
H  -3.785413 -1.565739 4.254619
H  -2.196514 -3.779452 0.957054
H  -2.89934 -3.680728 3.328848
totalener: -1590.07448824 hartree
nucrepener: 2945.41960814 hartree
electener: -4535.49409637 hartree
oneelecener: -8031.02598569 hartree
twoeener: 3495.53188932 hartree
kineticenergy: 1584.28109657 hartree
xcener: -135.014200073089 hartree
chargesum: -0.0000000
charge: -0.037594 -0.255349 -0.345750 -0.347812 -0.242349 0.098253 -0.059002 -0.053698 -0.221929 -0.246615 -0.067227 0.297031 -0.095926 -0.175150 0.261379 -0.137926 0.025262 -0.031925 -0.262112 -0.080832 0.183161 -0.052309 0.027679 -0.153318 -0.182320 -0.121159 -0.161474 -0.105690 0.093044 0.084287 0.090064 0.102295 0.037415 0.089291 0.069427 0.096173 0.120864 0.106686 0.090323 0.113009 0.088990 0.130950 0.100158 0.168181 0.135026 0.094642 0.107728 0.107614 0.149255 0.122724 0.123755 0.122800
qa: -0.0376 -0.2553 -0.3457 -0.3478 -0.2423 0.0983 -0.0590 -0.0537 -0.2219 -0.2466 -0.0672 0.2970 -0.0959 -0.1751 0.2614 -0.1379 0.0253 -0.0319 -0.2621 -0.0808 0.1832 -0.0523 0.0277 -0.1533 -0.1823 -0.1212 -0.1615 -0.1057 0.0930 0.0843 0.0901 0.1023 0.0374 0.0893 0.0694 0.0962 0.1209 0.1067 0.0903 0.1130 0.0890 0.1309 0.1002 0.1682 0.1350 0.0946 0.1077 0.1076 0.1493 0.1227 0.1238 0.1228
va: 2.4197 2.1077 2.1425 2.1465 2.2959 3.8834 3.8201 3.8216 3.9386 3.8971 3.8129 4.2679 3.5246 3.9783 4.1751 3.9825 3.8710 3.6261 3.9295 3.9679 3.6513 3.8484 3.6652 3.9909 3.8954 3.9658 3.9423 3.9341 1.0027 1.0186 1.0015 1.0124 1.0129 1.0050 1.0064 1.0040 1.0073 1.0051 1.0138 1.0098 1.0029 1.0076 0.9973 1.0016 1.0092 1.0070 1.0183 1.0111 1.0223 1.0004 1.0026 0.9992
dispcorr: -0.035792901 hartree
energy: -1590.110281138082
dipole: 10.75491 -9.09698 1.65794 -14.43761 14.57256 0.13496 10.02857 -10.15513 -0.12656
magnitude: 1.66823 au
magnitude: 4.24030 debye
