program: Orca
programVersion: 5.0.2
elementType: S O O O O C C C C C C C C C C C C C C C C C C C C C C C H H H H H H H H H H H H H H H H H H H H H H H H
charge: 0
multiplicity: 1
keywords: wb97x-d3
keywords: def2-TZVPP
keywords: def2/J RIJCOSX
keywords: DEFGRID2
keywords: scfconv7
keywords: smallprint printgap noloewdin
keywords: NOSOSCF
formula: C23H24O4S
InChI: InChI=1/C23H24O4S/c1-23(2)19(12-17-8-9-28-22(17)25)20(23)21(24)27-14-16-11-18(26-13-16)10-15-6-4-3-5-7-15/h3-7,11-13,19-20H,8-10,14H2,1-2H3
52 atoms
S  -0.016254 1.379588 -3.723633
O  2.297706 1.427057 0.631504
O  1.835071 0.398225 2.568811
O  -1.204703 -0.52215 -2.341627
O  -1.803725 2.409268 -0.698916
C  2.64919 -2.163083 1.007965
C  2.554473 -1.477904 -0.332448
C  3.093217 -0.742343 0.882689
C  1.384243 -2.513425 1.755029
C  3.738542 -3.197191 1.167273
C  1.262885 -1.094844 -0.935284
C  2.330525 0.395277 1.476232
C  1.159259 -0.265278 -1.973675
C  2.274026 0.450195 -2.664275
C  -0.166975 0.038475 -2.561403
C  1.695452 1.742888 -3.238838
C  1.449725 2.536618 0.964908
C  0.061808 2.288676 0.494253
C  -0.861876 1.30316 0.970977
C  -0.57291 2.91919 -0.522072
C  -1.969197 1.416698 0.201236
C  -3.255735 0.669378 0.168524
C  -3.208795 -0.520706 1.087707
C  -3.651873 -0.422975 2.401142
C  -2.679734 -1.730201 0.645856
C  -3.571198 -1.510117 3.259776
C  -2.600344 -2.818801 1.50091
C  -3.045683 -2.712065 2.811197
H  3.317307 -1.743881 -1.059096
H  4.165368 -0.561946 0.872204
H  0.575261 -1.796994 1.630611
H  1.015478 -3.483901 1.417966
H  1.581359 -2.581388 2.824433
H  3.403039 -4.172417 0.810988
H  4.637897 -2.933689 0.608086
H  4.021084 -3.303992 2.215743
H  0.349061 -1.508377 -0.521592
H  2.667378 -0.16692 -3.477905
H  3.098291 0.671328 -1.986322
H  2.24969 2.096915 -4.105761
H  1.689557 2.52998 -2.484794
H  1.483648 2.729175 2.037963
H  1.883562 3.394871 0.451938
H  -0.718672 0.609325 1.782211
H  -0.284323 3.727204 -1.175622
H  -4.08126 1.330781 0.450301
H  -3.453873 0.346911 -0.856902
H  -4.062344 0.514384 2.757977
H  -2.327255 -1.813002 -0.374848
H  -3.920549 -1.417544 4.279804
H  -2.193161 -3.755113 1.141135
H  -2.985429 -3.562063 3.478192
totalener: -1590.07462698 hartree
nucrepener: 2939.83027864 hartree
electener: -4529.90490562 hartree
oneelecener: -8019.85102403 hartree
twoeener: 3489.94611840 hartree
kineticenergy: 1584.27989890 hartree
xcener: -135.013699122374 hartree
chargesum: 0.0000000
charge: -0.036980 -0.255398 -0.345817 -0.348075 -0.242412 0.097353 -0.058893 -0.054757 -0.223090 -0.246353 -0.062514 0.298224 -0.098549 -0.176504 0.261634 -0.137904 0.025436 -0.029405 -0.263966 -0.082650 0.185252 -0.052439 0.025359 -0.149811 -0.183664 -0.123533 -0.155221 -0.108405 0.092717 0.084663 0.040544 0.090689 0.101794 0.089411 0.069588 0.096180 0.118533 0.106658 0.090143 0.113143 0.089075 0.130493 0.100055 0.167064 0.135358 0.094211 0.108070 0.107123 0.148623 0.122450 0.123668 0.122830
qa: -0.0370 -0.2554 -0.3458 -0.3481 -0.2424 0.0974 -0.0589 -0.0548 -0.2231 -0.2464 -0.0625 0.2982 -0.0985 -0.1765 0.2616 -0.1379 0.0254 -0.0294 -0.2640 -0.0827 0.1853 -0.0524 0.0254 -0.1498 -0.1837 -0.1235 -0.1552 -0.1084 0.0927 0.0847 0.0405 0.0907 0.1018 0.0894 0.0696 0.0962 0.1185 0.1067 0.0901 0.1131 0.0891 0.1305 0.1001 0.1671 0.1354 0.0942 0.1081 0.1071 0.1486 0.1224 0.1237 0.1228
va: 2.4203 2.1077 2.1428 2.1464 2.2962 3.8833 3.8187 3.8219 3.9391 3.8969 3.8118 4.2665 3.5267 3.9804 4.1766 3.9825 3.8725 3.6223 3.9310 3.9690 3.6480 3.8460 3.6660 3.9902 3.9011 3.9678 3.9446 3.9404 1.0026 1.0187 1.0128 1.0013 1.0119 1.0050 1.0063 1.0040 1.0095 1.0050 1.0136 1.0097 1.0028 1.0074 0.9973 1.0031 1.0088 1.0076 1.0181 1.0111 1.0221 1.0006 1.0025 0.9992
dispcorr: -0.035492582 hartree
energy: -1590.110119563406
dipole: 11.01085 -9.33918 1.67167 -13.89870 14.06874 0.17005 10.34144 -10.47615 -0.13472
magnitude: 1.68569 au
magnitude: 4.28468 debye
