program: Orca
programVersion: 5.0.2
elementType: S O O O O C C C C C C C C C C C C C C C C C C C C C C C H H H H H H H H H H H H H H H H H H H H H H H H
charge: 0
multiplicity: 1
keywords: wb97x-d3
keywords: def2-TZVPP
keywords: def2/J RIJCOSX
keywords: DEFGRID2
keywords: scfconv7
keywords: smallprint printgap noloewdin
keywords: NOSOSCF
formula: C23H24O4S
InChI: InChI=1/C23H24O4S/c1-23(2)19(12-17-8-9-28-22(17)25)20(23)21(24)27-14-16-11-18(26-13-16)10-15-6-4-3-5-7-15/h3-7,11-13,19-20H,8-10,14H2,1-2H3
52 atoms
S  -1.253423 -2.22688 1.966269
O  2.493467 1.276734 0.447576
O  2.019574 2.34276 -1.458821
O  1.180396 -1.97259 2.938492
O  -1.688401 1.355038 1.706329
C  4.156545 -0.658854 -1.245998
C  2.798508 -1.236717 -1.033097
C  2.940584 0.178006 -1.590337
C  5.042208 -0.32175 -0.071787
C  4.937369 -1.159183 -2.440263
C  2.248406 -1.51049 0.311164
C  2.448016 1.37985 -0.877241
C  0.947723 -1.640104 0.567399
C  -0.188103 -1.426451 -0.377266
C  0.499699 -1.941045 1.950287
C  -1.40916 -2.177374 0.156981
C  1.816739 2.275767 1.222927
C  0.341128 2.086636 1.190366
C  -0.593513 2.5800 0.224557
C  -0.393123 1.352062 2.061425
C  -1.807177 2.103094 0.588411
C  -3.153034 2.198868 -0.034375
C  -3.525034 0.955881 -0.811596
C  -4.551456 0.120595 -0.389543
C  -2.833233 0.629381 -1.975079
C  -4.88944 -1.012883 -1.118401
C  -3.167084 -0.499568 -2.705217
C  -4.199666 -1.325085 -2.279204
H  2.461735 -1.944948 -1.786927
H  2.747218 0.27256 -2.652529
H  5.743634 0.468489 -0.34378
H  4.501691 0.008615 0.81004
H  5.630033 -1.198613 0.206797
H  5.644587 -0.404592 -2.787977
H  5.504771 -2.054454 -2.180495
H  4.286231 -1.41286 -3.277919
H  2.942751 -1.644177 1.133795
H  0.041044 -1.749005 -1.394274
H  -0.412308 -0.356593 -0.430945
H  -1.444076 -3.199723 -0.218383
H  -2.339627 -1.681947 -0.108704
H  2.198901 2.138175 2.232858
H  2.096482 3.273919 0.883778
H  -0.374612 3.202116 -0.62722
H  -0.130799 0.796894 2.948124
H  -3.90844 2.39996 0.729262
H  -3.153125 3.061651 -0.703942
H  -5.095088 0.356564 0.517199
H  -2.023052 1.265953 -2.311915
H  -5.692765 -1.651803 -0.775783
H  -2.62371 -0.733493 -3.611572
H  -4.464433 -2.205172 -2.850051
totalener: -1590.07646403 hartree
nucrepener: 2911.28294039 hartree
electener: -4501.35940442 hartree
oneelecener: -7962.24026451 hartree
twoeener: 3460.88086009 hartree
kineticenergy: 1584.28773724 hartree
xcener: -135.017934489142 hartree
chargesum: 0.0000000
charge: -0.037940 -0.256024 -0.376727 -0.333757 -0.232003 0.114166 -0.053182 -0.106793 -0.279780 -0.243887 -0.029070 0.352616 -0.160343 -0.106433 0.220793 -0.068625 0.031439 -0.062265 -0.237908 -0.069054 0.196776 -0.133996 0.071141 -0.140734 -0.199398 -0.105557 -0.120578 -0.149177 0.092363 0.085860 0.093942 0.096544 0.094433 0.094938 0.089683 0.071763 0.120283 0.087446 0.073142 0.110541 0.053331 0.100237 0.120261 0.146672 0.159129 0.096098 0.115414 0.109080 0.125735 0.126448 0.127327 0.125630
qa: -0.0379 -0.2560 -0.3767 -0.3338 -0.2320 0.1142 -0.0532 -0.1068 -0.2798 -0.2439 -0.0291 0.3526 -0.1603 -0.1064 0.2208 -0.0686 0.0314 -0.0623 -0.2379 -0.0691 0.1968 -0.1340 0.0711 -0.1407 -0.1994 -0.1056 -0.1206 -0.1492 0.0924 0.0859 0.0939 0.0965 0.0944 0.0949 0.0897 0.0718 0.1203 0.0874 0.0731 0.1105 0.0533 0.1002 0.1203 0.1467 0.1591 0.0961 0.1154 0.1091 0.1257 0.1264 0.1273 0.1256
va: 2.4417 2.1008 2.1259 2.1558 2.3015 3.7636 3.8132 3.8436 3.9154 3.9088 3.7851 4.2009 3.6186 3.9654 4.2291 3.9921 3.8910 3.6676 3.9883 3.9755 3.6055 3.8690 3.5953 3.9611 3.9196 3.9069 3.9159 3.9368 1.0084 1.0299 1.0030 1.0159 0.9994 1.0041 1.0044 1.0082 1.0212 1.0094 1.0161 1.0057 1.0211 1.0013 1.0009 1.0242 1.0072 1.0164 1.0042 1.0129 1.0128 1.0011 1.0014 1.0016
dispcorr: -0.034546585 hartree
energy: -1590.111010619500
dipole: 11.15803 -11.25637 -0.09834 -1.84770 1.78627 -0.06143 -15.59068 14.25707 -1.33361
magnitude: 1.33864 au
magnitude: 3.40255 debye
