program: Orca
programVersion: 5.0.2
elementType: S O O O O C C C C C C C C C C C C C C C C C C C C C C C H H H H H H H H H H H H H H H H H H H H H H H H
charge: 0
multiplicity: 1
keywords: wb97x-d3
keywords: def2-TZVPP
keywords: def2/J RIJCOSX
keywords: DEFGRID2
keywords: scfconv7
keywords: smallprint printgap noloewdin
keywords: NOSOSCF
formula: C23H24O4S
InChI: InChI=1/C23H24O4S/c1-23(2)19(12-17-8-9-28-22(17)25)20(23)21(24)27-14-16-11-18(26-13-16)10-15-6-4-3-5-7-15/h3-7,11-13,19-20H,8-10,14H2,1-2H3
52 atoms
S  -0.722299 -3.03845 -0.905429
O  2.343118 1.941589 -1.058521
O  2.226547 1.612739 1.149107
O  -0.066673 -2.310859 1.539417
O  -1.916254 0.756687 -1.751292
C  4.76413 -0.091411 0.944224
C  3.820751 -0.909138 0.122728
C  3.974995 0.591888 -0.140148
C  4.509748 0.153918 2.412299
C  6.234524 -0.264843 0.633714
C  2.533801 -1.429432 0.629619
C  2.776731 1.433794 0.096116
C  1.54641 -1.819454 -0.177502
C  1.513595 -1.74723 -1.669347
C  0.277741 -2.338639 0.391698
C  0.561135 -2.832623 -2.173526
C  1.1096 2.67351 -1.031552
C  -0.086233 1.787951 -1.034014
C  -0.651955 1.03362 0.044936
C  -0.903572 1.570352 -2.093061
C  -1.761461 0.434338 -0.446971
C  -2.82481 -0.387797 0.189197
C  -3.999875 0.456047 0.623733
C  -4.9991 0.805318 -0.278185
C  -4.084294 0.925613 1.929571
C  -6.059313 1.607234 0.116594
C  -5.143429 1.726701 2.328596
C  -6.134634 2.071151 1.421832
H  4.27075 -1.526546 -0.650543
H  4.513649 0.841621 -1.047542
H  3.460145 0.224439 2.677021
H  4.957107 -0.654054 2.993965
H  4.982423 1.085761 2.724909
H  6.41278 -0.454898 -0.42586
H  6.79666 0.629084 0.90821
H  6.648652 -1.104461 1.194131
H  2.380151 -1.500845 1.700676
H  2.499608 -1.865009 -2.120768
H  1.140188 -0.761585 -1.963887
H  1.077276 -3.782552 -2.310796
H  0.091247 -2.558868 -3.115898
H  1.092123 3.348678 -0.174693
H  1.130199 3.279092 -1.937137
H  -0.280957 0.958938 1.052865
H  -0.887938 1.928464 -3.110362
H  -3.151274 -1.168851 -0.500923
H  -2.391784 -0.897283 1.051182
H  -4.947669 0.44673 -1.299287
H  -3.31287 0.659883 2.642753
H  -6.830054 1.869492 -0.596603
H  -5.195215 2.079896 3.35042
H  -6.962783 2.69502 1.73145
totalener: -1590.07679080 hartree
nucrepener: 2822.36101298 hartree
electener: -4412.43780378 hartree
oneelecener: -7784.87553937 hartree
twoeener: 3372.43773560 hartree
kineticenergy: 1584.27902107 hartree
xcener: -135.012148384244 hartree
chargesum: -0.0000000
charge: -0.044474 -0.256619 -0.382584 -0.331518 -0.250714 0.123894 -0.091750 -0.080813 -0.258626 -0.244064 -0.033776 0.345407 -0.123092 -0.135091 0.231729 -0.129770 0.049613 -0.090094 -0.261027 -0.036673 0.259597 -0.139811 0.069027 -0.181699 -0.166056 -0.126437 -0.125404 -0.130530 0.088028 0.082135 0.099682 0.088563 0.089020 0.069487 0.094509 0.091575 0.123138 0.083752 0.098247 0.107444 0.103266 0.118848 0.095409 0.159181 0.133576 0.109128 0.119698 0.108863 0.111684 0.120853 0.122311 0.122956
qa: -0.0445 -0.2566 -0.3826 -0.3315 -0.2507 0.1239 -0.0918 -0.0808 -0.2586 -0.2441 -0.0338 0.3454 -0.1231 -0.1351 0.2317 -0.1298 0.0496 -0.0901 -0.2610 -0.0367 0.2596 -0.1398 0.0690 -0.1817 -0.1661 -0.1264 -0.1254 -0.1305 0.0880 0.0821 0.0997 0.0886 0.0890 0.0695 0.0945 0.0916 0.1231 0.0838 0.0982 0.1074 0.1033 0.1188 0.0954 0.1592 0.1336 0.1091 0.1197 0.1089 0.1117 0.1209 0.1223 0.1230
va: 2.4098 2.1213 2.1010 2.1525 2.2938 3.7956 3.8836 3.8128 3.9095 3.9030 3.7743 4.1932 3.6170 3.9649 4.2151 3.9748 3.9037 3.6685 3.9635 3.9780 3.4905 3.7987 3.6829 4.0238 3.9992 3.9625 3.9662 3.9565 1.0085 1.0326 1.0219 0.9989 1.0046 1.0065 1.0049 1.0050 1.0244 1.0113 1.0236 1.0032 1.0072 1.0038 0.9968 1.0246 1.0085 1.0188 1.0217 1.0191 1.0119 1.0012 1.0013 1.0002
dispcorr: -0.031104848 hartree
energy: -1590.107895643977
dipole: 16.49737 -15.08462 1.41275 3.43696 -3.19488 0.24208 2.28821 -3.81399 -1.52578
magnitude: 2.09344 au
magnitude: 5.32109 debye
