program: Orca
programVersion: 5.0.2
elementType: S O O O O C C C C C C C C C C C C C C C C C C C C C C C H H H H H H H H H H H H H H H H H H H H H H H H
charge: 0
multiplicity: 1
keywords: wb97x-d3
keywords: def2-TZVPP
keywords: def2/J RIJCOSX
keywords: DEFGRID2
keywords: scfconv7
keywords: smallprint printgap noloewdin
keywords: NOSOSCF
formula: C23H24O4S
InChI: InChI=1/C23H24O4S/c1-23(2)19(12-17-8-9-28-22(17)25)20(23)21(24)27-14-16-11-18(26-13-16)10-15-6-4-3-5-7-15/h3-7,11-13,19-20H,8-10,14H2,1-2H3
52 atoms
S  -1.328708 -2.37015 1.986356
O  2.496617 1.361356 0.462474
O  2.053767 2.413008 -1.459008
O  1.085192 -1.968185 2.960417
O  -1.685782 1.445262 1.602659
C  4.082849 -0.661719 -1.192842
C  2.695885 -1.184098 -0.984452
C  2.911702 0.219995 -1.559043
C  4.983497 -0.348204 -0.023753
C  4.845039 -1.22282 -2.372382
C  2.11706 -1.398166 0.35236
C  2.453416 1.44705 -0.863989
C  0.872467 -1.825366 0.569347
C  -0.182499 -2.136604 -0.443184
C  0.414453 -2.026415 1.966326
C  -1.546312 -1.965989 0.229132
C  1.828952 2.375571 1.226418
C  0.352134 2.205582 1.173746
C  -0.564013 2.766176 0.22825
C  -0.396698 1.414441 1.979909
C  -1.783742 2.268642 0.535343
C  -3.110907 2.381624 -0.122173
C  -3.464538 1.129592 -0.893015
C  -2.704847 0.756171 -1.999031
C  -4.525008 0.320488 -0.507487
C  -3.006348 -0.394815 -2.708317
C  -4.828171 -0.836204 -1.21416
C  -4.071154 -1.196264 -2.317315
H  2.342215 -1.886387 -1.733548
H  2.727012 0.305446 -2.623508
H  5.73362 0.386948 -0.318959
H  4.467053 0.04683 0.845024
H  5.512614 -1.251424 0.284094
H  4.188467 -1.459752 -3.210423
H  5.590761 -0.510299 -2.728418
H  5.36597 -2.139389 -2.091063
H  2.739811 -1.224305 1.221226
H  -0.069884 -3.168813 -0.788128
H  -0.12018 -1.490958 -1.320189
H  -2.30169 -2.619455 -0.200314
H  -1.901899 -0.941827 0.146896
H  2.200355 2.236928 2.240233
H  2.127309 3.367436 0.884883
H  -0.327034 3.437876 -0.580037
H  -0.15194 0.795772 2.828927
H  -3.887818 2.59788 0.615186
H  -3.079116 3.23738 -0.799362
H  -1.863916 1.369409 -2.301545
H  -5.120271 0.592986 0.355489
H  -2.411058 -0.66652 -3.570437
H  -5.657909 -1.455409 -0.899623
H  -4.3089 -2.094578 -2.871704
totalener: -1590.07711377 hartree
nucrepener: 2894.80805134 hartree
electener: -4484.88516511 hartree
oneelecener: -7929.24881335 hartree
twoeener: 3444.36364824 hartree
kineticenergy: 1584.29670479 hartree
xcener: -135.018025353057 hartree
chargesum: -0.0000000
charge: -0.036673 -0.264762 -0.374541 -0.334814 -0.242777 0.118982 -0.041421 -0.093792 -0.271626 -0.241426 -0.054761 0.356264 -0.131974 -0.167193 0.216697 -0.084198 0.033435 -0.042465 -0.244624 -0.064128 0.199383 -0.126142 0.026189 -0.130735 -0.100729 -0.166545 -0.148680 -0.123614 0.096037 0.087027 0.093205 0.095301 0.096247 0.072425 0.094488 0.091144 0.114658 0.101044 0.083310 0.114817 0.049610 0.102758 0.118895 0.145981 0.158003 0.095815 0.112182 0.120134 0.109928 0.127575 0.127610 0.128474
qa: -0.0367 -0.2648 -0.3745 -0.3348 -0.2428 0.1190 -0.0414 -0.0938 -0.2716 -0.2414 -0.0548 0.3563 -0.1320 -0.1672 0.2167 -0.0842 0.0334 -0.0425 -0.2446 -0.0641 0.1994 -0.1261 0.0262 -0.1307 -0.1007 -0.1665 -0.1487 -0.1236 0.0960 0.0870 0.0932 0.0953 0.0962 0.0724 0.0945 0.0911 0.1147 0.1010 0.0833 0.1148 0.0496 0.1028 0.1189 0.1460 0.1580 0.0958 0.1122 0.1201 0.1099 0.1276 0.1276 0.1285
va: 2.4405 2.1034 2.1305 2.1547 2.2958 3.7911 3.7530 3.8658 3.9084 3.9023 3.8292 4.2145 3.5932 3.9785 4.2494 3.9469 3.8912 3.6619 4.0300 3.9697 3.6109 3.8843 3.6467 3.8768 3.9333 3.9391 3.9562 3.8800 1.0062 1.0274 1.0023 1.0177 1.0004 1.0078 1.0043 1.0043 1.0355 1.0004 1.0055 1.0077 1.0260 1.0011 1.0016 1.0218 1.0067 1.0150 1.0059 1.0140 1.0107 1.0009 1.0011 0.9993
dispcorr: -0.033374293 hartree
energy: -1590.110488061912
dipole: 11.10833 -11.13427 -0.02594 -2.17927 2.11018 -0.06909 -15.40026 14.02342 -1.37684
magnitude: 1.37882 au
magnitude: 3.50468 debye
