program: Orca
programVersion: 5.0.2
elementType: S O O O O C C C C C C C C C C C C C C C C C C C C C C C H H H H H H H H H H H H H H H H H H H H H H H H
charge: 0
multiplicity: 1
keywords: wb97x-d3
keywords: def2-TZVPP
keywords: def2/J RIJCOSX
keywords: DEFGRID2
keywords: scfconv7
keywords: smallprint printgap noloewdin
keywords: NOSOSCF
formula: C23H24O4S
InChI: InChI=1/C23H24O4S/c1-23(2)19(12-17-8-9-28-22(17)25)20(23)21(24)27-14-16-11-18(26-13-16)10-15-6-4-3-5-7-15/h3-7,11-13,19-20H,8-10,14H2,1-2H3
52 atoms
S  -1.113396 -2.594691 1.697748
O  2.277239 2.296991 -0.378661
O  2.409073 0.649509 1.134719
O  1.113882 -4.010035 1.606971
O  -1.872693 2.397515 1.270594
C  4.268212 -0.642734 -1.070379
C  2.915078 -1.243795 -1.229253
C  3.054829 0.268164 -1.147325
C  5.00764 -0.81383 0.233321
C  5.174036 -0.61876 -2.278484
C  2.299204 -2.086477 -0.179448
C  2.556046 1.044032 0.009693
C  1.009097 -2.09853 0.145721
C  -0.090933 -1.226989 -0.362539
C  0.524964 -3.05858 1.179029
C  -1.048583 -1.013754 0.805078
C  1.641464 3.154976 0.568234
C  0.174987 2.91236 0.591296
C  -0.728929 3.027576 -0.51288
C  -0.583839 2.521469 1.640066
C  -1.954749 2.700666 -0.042002
C  -3.28218 2.560171 -0.69702
C  -3.669156 1.110057 -0.866451
C  -4.500617 0.480933 0.05196
C  -3.148604 0.36525 -1.920118
C  -4.802842 -0.867985 -0.075284
C  -3.451914 -0.980806 -2.053176
C  -4.276907 -1.603414 -1.126608
H  2.668057 -1.577822 -2.235017
H  2.940766 0.79013 -2.090293
H  5.711976 0.005998 0.383144
H  4.353086 -0.85029 1.100197
H  5.584954 -1.740031 0.209502
H  5.888007 0.204158 -2.217856
H  5.742279 -1.547931 -2.349092
H  4.613972 -0.504666 -3.207579
H  2.950781 -2.792601 0.326486
H  -0.623452 -1.733748 -1.17339
H  0.258597 -0.27209 -0.754912
H  -2.049254 -0.742776 0.481459
H  -0.66989 -0.243625 1.474922
H  2.075229 3.037594 1.562507
H  1.862119 4.164062 0.219022
H  -0.488381 3.313237 -1.52451
H  -0.345768 2.301281 2.66812
H  -4.046027 3.088156 -0.120221
H  -3.232709 3.052496 -1.669881
H  -4.908679 1.047396 0.880094
H  -2.492002 0.841802 -2.63905
H  -5.444792 -1.346465 0.65236
H  -3.041557 -1.546455 -2.879724
H  -4.506632 -2.655971 -1.223007
totalener: -1590.07764632 hartree
nucrepener: 2853.90746809 hartree
electener: -4443.98511441 hartree
oneelecener: -7847.51064496 hartree
twoeener: 3403.52553055 hartree
kineticenergy: 1584.28438906 hartree
xcener: -135.014086458844 hartree
chargesum: 0.0000000
charge: -0.051967 -0.263306 -0.367404 -0.322431 -0.247395 0.116456 -0.047307 -0.086644 -0.283777 -0.239006 -0.107540 0.296192 -0.065053 -0.136394 0.217580 -0.074189 0.069237 -0.037071 -0.302817 -0.050571 0.229965 -0.138604 0.074022 -0.127782 -0.162185 -0.117833 -0.159089 -0.125872 0.096561 0.086045 0.087733 0.116803 0.091756 0.091953 0.090816 0.070731 0.120940 0.099532 0.067437 0.049224 0.125852 0.106154 0.109219 0.125986 0.153998 0.105485 0.106695 0.110976 0.107500 0.128100 0.132840 0.128450
qa: -0.0520 -0.2633 -0.3674 -0.3224 -0.2474 0.1165 -0.0473 -0.0866 -0.2838 -0.2390 -0.1075 0.2962 -0.0651 -0.1364 0.2176 -0.0742 0.0692 -0.0371 -0.3028 -0.0506 0.2300 -0.1386 0.0740 -0.1278 -0.1622 -0.1178 -0.1591 -0.1259 0.0966 0.0860 0.0877 0.1168 0.0918 0.0920 0.0908 0.0707 0.1209 0.0995 0.0674 0.0492 0.1259 0.1062 0.1092 0.1260 0.1540 0.1055 0.1067 0.1110 0.1075 0.1281 0.1328 0.1284
va: 2.4312 2.1149 2.1129 2.1694 2.2954 3.7355 3.8713 3.8017 3.9189 3.9028 3.8992 4.2003 3.6305 3.9998 4.2523 3.9572 3.8911 3.6419 4.0248 3.9489 3.5892 3.8736 3.5785 3.9420 3.9159 3.9395 3.9105 3.9240 1.0059 1.0334 1.0036 1.0138 0.9992 1.0045 1.0045 1.0077 1.0183 1.0144 1.0118 1.0202 1.0179 1.0136 0.9878 1.0206 1.0027 1.0111 1.0096 1.0134 1.0142 1.0012 0.9992 1.0021
dispcorr: -0.032659628 hartree
energy: -1590.110305947127
dipole: 11.81261 -11.94018 -0.12757 4.73516 -2.81616 1.91900 -13.14606 11.48216 -1.66390
magnitude: 2.54311 au
magnitude: 6.46406 debye
