program: Orca
programVersion: 5.0.2
elementType: S O O O O C C C C C C C C C C C C C C C C C C C C C C C H H H H H H H H H H H H H H H H H H H H H H H H
charge: 0
multiplicity: 1
keywords: wb97x-d3
keywords: def2-TZVPP
keywords: def2/J RIJCOSX
keywords: DEFGRID2
keywords: scfconv7
keywords: smallprint printgap noloewdin
keywords: NOSOSCF
formula: C23H24O4S
InChI: InChI=1/C23H24O4S/c1-23(2)19(12-17-8-9-28-22(17)25)20(23)21(24)27-14-16-11-18(26-13-16)10-15-6-4-3-5-7-15/h3-7,11-13,19-20H,8-10,14H2,1-2H3
52 atoms
S  -1.464165 -2.343149 1.488826
O  2.313572 2.378164 -0.722964
O  3.141292 1.196822 0.982697
O  0.810483 -1.916575 2.749937
O  -1.176928 1.320725 1.608454
C  4.307539 -0.760712 -1.084884
C  2.853975 -1.098894 -1.003627
C  3.302865 0.350932 -1.249496
C  5.204672 -0.861094 0.125109
C  5.012848 -1.161061 -2.361508
C  2.173677 -1.4495 0.256902
C  2.952408 1.330447 -0.197895
C  0.85555 -1.625857 0.361158
C  -0.180019 -1.479612 -0.705029
C  0.257453 -1.941652 1.686317
C  -1.364914 -2.364756 -0.32309
C  1.624942 3.224401 0.208724
C  0.330578 2.610387 0.61949
C  -0.952811 2.852037 0.036219
C  0.120793 1.667892 1.573357
C  -1.830998 2.043799 0.677028
C  -3.295406 1.834795 0.537267
C  -3.694793 0.679173 -0.353703
C  -4.55047 -0.312448 0.109344
C  -3.265902 0.625297 -1.677109
C  -4.989956 -1.323317 -0.735302
C  -3.702506 -0.380802 -2.524316
C  -4.573495 -1.356598 -2.056981
H  2.421044 -1.557573 -1.88787
H  3.149034 0.711979 -2.259827
H  6.079085 -0.222339 -0.007441
H  4.730352 -0.566999 1.055264
H  5.56046 -1.887477 0.22968
H  4.358168 -1.096597 -3.23197
H  5.874015 -0.517333 -2.5469
H  5.372578 -2.1890 -2.294072
H  2.768491 -1.563048 1.155238
H  0.19024 -1.743691 -1.696954
H  -0.508614 -0.436931 -0.754131
H  -1.217199 -3.391333 -0.659245
H  -2.300143 -1.996352 -0.734961
H  2.258782 3.4443 1.067659
H  1.45206 4.153818 -0.331716
H  -1.185548 3.553597 -0.749751
H  0.776579 1.163953 2.264332
H  -3.740336 1.70304 1.526148
H  -3.725968 2.753368 0.130492
H  -4.882198 -0.293824 1.140212
H  -2.586716 1.382912 -2.050248
H  -5.657957 -2.085895 -0.357056
H  -3.365666 -0.401704 -3.552667
H  -4.919401 -2.140415 -2.717884
totalener: -1590.07710162 hartree
nucrepener: 2883.20766287 hartree
electener: -4473.28476449 hartree
oneelecener: -7906.38562726 hartree
twoeener: 3433.10086277 hartree
kineticenergy: 1584.28006589 hartree
xcener: -135.015001795294 hartree
chargesum: -0.0000000
charge: -0.042276 -0.266165 -0.392035 -0.325246 -0.230712 0.128196 -0.069825 -0.074508 -0.267154 -0.239271 -0.008383 0.336249 -0.171199 -0.136149 0.219684 -0.075578 0.070305 -0.056738 -0.269341 -0.034332 0.192938 -0.110240 0.086014 -0.184845 -0.207436 -0.099494 -0.116218 -0.137172 0.086433 0.080572 0.085660 0.108478 0.091134 0.070594 0.093459 0.091691 0.123581 0.079755 0.082179 0.110698 0.053560 0.119686 0.097047 0.131284 0.167073 0.094009 0.110790 0.108430 0.116765 0.127687 0.124873 0.125494
qa: -0.0423 -0.2662 -0.3920 -0.3252 -0.2307 0.1282 -0.0698 -0.0745 -0.2672 -0.2393 -0.0084 0.3362 -0.1712 -0.1361 0.2197 -0.0756 0.0703 -0.0567 -0.2693 -0.0343 0.1929 -0.1102 0.0860 -0.1848 -0.2074 -0.0995 -0.1162 -0.1372 0.0864 0.0806 0.0857 0.1085 0.0911 0.0706 0.0935 0.0917 0.1236 0.0798 0.0822 0.1107 0.0536 0.1197 0.0970 0.1313 0.1671 0.0940 0.1108 0.1084 0.1168 0.1277 0.1249 0.1255
va: 2.4379 2.1304 2.0858 2.1604 2.3139 3.7816 3.8351 3.8590 3.9026 3.8965 3.7624 4.2019 3.6589 3.9990 4.2225 4.0102 3.8544 3.6862 4.0236 3.9481 3.6357 3.8553 3.6059 3.9652 3.9267 3.8973 3.9156 3.9157 1.0093 1.0320 1.0026 1.0232 0.9996 1.0069 1.0050 1.0049 1.0304 1.0147 1.0153 1.0050 1.0132 1.0099 0.9951 1.0134 1.0144 1.0203 0.9988 1.0161 1.0170 1.0007 1.0024 1.0012
dispcorr: -0.033119549 hartree
energy: -1590.110221168073
dipole: 10.08487 -10.48039 -0.39552 -1.91946 2.42595 0.50649 -16.57729 14.30823 -2.26906
magnitude: 2.35831 au
magnitude: 5.99435 debye
