program: Orca
programVersion: 5.0.2
elementType: S O O O O C C C C C C C C C C C C C C C C C C C C C C C H H H H H H H H H H H H H H H H H H H H H H H H
charge: 0
multiplicity: 1
keywords: wb97x-d3
keywords: def2-TZVPP
keywords: def2/J RIJCOSX
keywords: DEFGRID2
keywords: scfconv7
keywords: smallprint printgap noloewdin
keywords: NOSOSCF
formula: C23H24O4S
InChI: InChI=1/C23H24O4S/c1-23(2)19(12-17-8-9-28-22(17)25)20(23)21(24)27-14-16-11-18(26-13-16)10-15-6-4-3-5-7-15/h3-7,11-13,19-20H,8-10,14H2,1-2H3
52 atoms
S  -1.528055 -2.633444 1.405079
O  2.399064 2.529789 -0.627251
O  3.248873 1.308404 1.039176
O  0.542024 -1.627233 2.687438
O  -1.121276 1.37913 1.553796
C  4.168533 -0.734805 -1.079949
C  2.681635 -0.929785 -1.018754
C  3.285754 0.473715 -1.207734
C  5.041577 -0.980347 0.126956
C  4.831217 -1.167654 -2.368956
C  1.966061 -1.256418 0.221644
C  3.018112 1.456225 -0.132149
C  0.685928 -1.629555 0.284316
C  -0.298196 -1.794571 -0.827799
C  0.071882 -1.885178 1.614468
C  -1.309522 -2.851004 -0.384052
C  1.710018 3.353259 0.325553
C  0.403433 2.7329 0.684511
C  -0.865698 3.004294 0.083124
C  0.174885 1.733907 1.574091
C  -1.754615 2.15609 0.651897
C  -3.214239 1.953334 0.464708
C  -3.575026 0.749582 -0.375029
C  -4.27804 -0.31779 0.167571
C  -3.239981 0.711918 -1.725781
C  -4.668823 -1.387002 -0.627382
C  -3.623141 -0.354979 -2.52249
C  -4.348775 -1.405947 -1.976041
H  2.217284 -1.309962 -1.922705
H  3.166914 0.877201 -2.206663
H  5.987111 -0.447999 0.014053
H  4.604557 -0.659391 1.065962
H  5.269229 -2.044931 0.200015
H  5.080126 -2.229447 -2.3339
H  4.189899 -1.007016 -3.23693
H  5.756355 -0.613263 -2.534353
H  2.501506 -1.178284 1.15973
H  0.165998 -2.085431 -1.771112
H  -0.820847 -0.849145 -0.999814
H  -0.943744 -3.859466 -0.578854
H  -2.269822 -2.722724 -0.876632
H  2.332523 3.530406 1.202304
H  1.557932 4.304789 -0.181438
H  -1.08243 3.747309 -0.668342
H  0.814605 1.190488 2.249949
H  -3.703018 1.879248 1.439396
H  -3.615089 2.852232 -0.009494
H  -4.529223 -0.313028 1.22082
H  -2.678147 1.531572 -2.158978
H  -5.22421 -2.206026 -0.189259
H  -3.364317 -0.362968 -3.573378
H  -4.661094 -2.234132 -2.598961
totalener: -1590.07709988 hartree
nucrepener: 2880.10906749 hartree
electener: -4470.18616737 hartree
oneelecener: -7900.27655295 hartree
twoeener: 3430.09038558 hartree
kineticenergy: 1584.28275985 hartree
xcener: -135.014897769200 hartree
chargesum: -0.0000000
charge: -0.043496 -0.265827 -0.388494 -0.330432 -0.237673 0.106937 0.002429 -0.066164 -0.256020 -0.239980 -0.092276 0.327119 -0.154641 -0.139075 0.227799 -0.137598 0.066825 -0.051717 -0.273244 -0.035371 0.201742 -0.124402 0.092493 -0.160433 -0.183968 -0.139968 -0.126947 -0.140643 0.080588 0.082600 0.084520 0.109804 0.088716 0.092278 0.070975 0.092999 0.134195 0.080039 0.092014 0.112711 0.104411 0.120160 0.096456 0.128194 0.170101 0.096326 0.113153 0.110065 0.111893 0.132217 0.125075 0.133535
qa: -0.0435 -0.2658 -0.3885 -0.3304 -0.2377 0.1069 0.0024 -0.0662 -0.2560 -0.2400 -0.0923 0.3271 -0.1546 -0.1391 0.2278 -0.1376 0.0668 -0.0517 -0.2732 -0.0354 0.2017 -0.1244 0.0925 -0.1604 -0.1840 -0.1400 -0.1269 -0.1406 0.0806 0.0826 0.0845 0.1098 0.0887 0.0923 0.0710 0.0930 0.1342 0.0800 0.0920 0.1127 0.1044 0.1202 0.0965 0.1282 0.1701 0.0963 0.1132 0.1101 0.1119 0.1322 0.1251 0.1335
va: 2.4212 2.1285 2.0897 2.1529 2.3101 3.7784 3.7683 3.8645 3.8994 3.8986 3.8228 4.2328 3.6656 3.9816 4.2195 3.9329 3.8542 3.6991 4.0499 3.9406 3.6370 3.8547 3.5795 3.9533 3.9307 3.8849 3.9188 3.8779 1.0119 1.0310 1.0023 1.0231 1.0005 1.0045 1.0071 1.0053 1.0293 1.0145 1.0155 1.0057 1.0258 1.0107 0.9950 1.0138 1.0144 1.0169 1.0019 1.0154 1.0149 0.9995 1.0015 0.9977
dispcorr: -0.032568992 hartree
energy: -1590.109668874979
dipole: 9.90724 -10.20527 -0.29803 -3.15768 3.41233 0.25465 -16.49923 14.23428 -2.26495
magnitude: 2.29862 au
magnitude: 5.84264 debye
