program: Orca
programVersion: 5.0.2
elementType: S O O O O C C C C C C C C C C C C C C C C C C C C C C C H H H H H H H H H H H H H H H H H H H H H H H H
charge: 0
multiplicity: 1
keywords: wb97x-d3
keywords: def2-TZVPP
keywords: def2/J RIJCOSX
keywords: DEFGRID2
keywords: scfconv7
keywords: smallprint printgap noloewdin
keywords: NOSOSCF
formula: C23H24O4S
InChI: InChI=1/C23H24O4S/c1-23(2)19(12-17-8-9-28-22(17)25)20(23)21(24)27-14-16-11-18(26-13-16)10-15-6-4-3-5-7-15/h3-7,11-13,19-20H,8-10,14H2,1-2H3
52 atoms
S  -1.188137 -2.744804 1.854065
O  2.236405 2.428579 -0.622468
O  2.719953 1.017001 1.04478
O  1.321777 -3.079827 2.593144
O  -1.542903 1.891408 1.428256
C  4.163624 -0.646523 -1.163675
C  2.771311 -1.165031 -1.020303
C  3.013277 0.333052 -1.227315
C  5.112189 -0.657167 0.009501
C  4.854318 -0.911169 -2.481231
C  2.255041 -1.706236 0.251215
C  2.665077 1.262116 -0.131715
C  0.979414 -2.035074 0.455253
C  -0.176461 -1.847484 -0.474239
C  0.586599 -2.663868 1.743283
C  -1.437516 -1.710809 0.381087
C  1.631551 3.33197 0.311335
C  0.225956 2.925026 0.581037
C  -0.924583 3.235128 -0.211164
C  -0.220528 2.102133 1.559849
C  -1.968282 2.579363 0.347074
C  -3.391988 2.430863 -0.047177
C  -3.685455 1.104914 -0.715613
C  -2.981564 0.72308 -1.854976
C  -4.670191 0.257216 -0.225915
C  -3.270011 -0.468414 -2.4998
C  -4.961648 -0.939511 -0.868013
C  -4.266282 -1.303379 -2.010174
H  2.350678 -1.640505 -1.901883
H  2.774621 0.708805 -2.215462
H  5.907159 0.073452 -0.147345
H  4.64058 -0.424834 0.959547
H  5.581467 -1.638703 0.095014
H  4.154136 -0.921208 -3.317554
H  5.607843 -0.149502 -2.687773
H  5.356236 -1.879905 -2.460079
H  2.95603 -1.889104 1.057171
H  -0.273775 -2.718112 -1.130462
H  -0.059123 -0.969022 -1.11087
H  -2.330531 -2.038844 -0.144772
H  -1.592228 -0.680513 0.694255
H  2.217438 3.389864 1.228757
H  1.667227 4.30491 -0.176823
H  -0.960892 3.866536 -1.085061
H  0.276818 1.602685 2.374902
H  -4.041842 2.558081 0.82219
H  -3.636342 3.245007 -0.733692
H  -2.198626 1.365881 -2.24027
H  -5.219537 0.533673 0.666075
H  -2.717933 -0.746404 -3.388366
H  -5.733355 -1.586816 -0.472495
H  -4.494852 -2.233373 -2.513864
totalener: -1590.07864695 hartree
nucrepener: 2832.17176465 hartree
electener: -4422.25041160 hartree
oneelecener: -7804.01109160 hartree
twoeener: 3381.76068001 hartree
kineticenergy: 1584.28291797 hartree
xcener: -135.012572990441 hartree
chargesum: -0.0000000
charge: -0.044541 -0.268507 -0.394643 -0.322631 -0.253615 0.128074 -0.073618 -0.077149 -0.282980 -0.234096 -0.018090 0.347395 -0.141437 -0.161451 0.226484 -0.132590 0.066844 -0.051384 -0.299312 -0.015778 0.219911 -0.104951 0.010310 -0.137750 -0.118094 -0.151209 -0.134771 -0.130321 0.095823 0.082902 0.087553 0.107653 0.097259 0.070975 0.092817 0.091508 0.115325 0.098126 0.079275 0.108853 0.097340 0.116157 0.101628 0.132431 0.158914 0.095758 0.108718 0.115871 0.110066 0.126364 0.128626 0.129956
qa: -0.0445 -0.2685 -0.3946 -0.3226 -0.2536 0.1281 -0.0736 -0.0771 -0.2830 -0.2341 -0.0181 0.3474 -0.1414 -0.1615 0.2265 -0.1326 0.0668 -0.0514 -0.2993 -0.0158 0.2199 -0.1050 0.0103 -0.1377 -0.1181 -0.1512 -0.1348 -0.1303 0.0958 0.0829 0.0876 0.1077 0.0973 0.0710 0.0928 0.0915 0.1153 0.0981 0.0793 0.1089 0.0973 0.1162 0.1016 0.1324 0.1589 0.0958 0.1087 0.1159 0.1101 0.1264 0.1286 0.1300
va: 2.4333 2.1326 2.0833 2.1722 2.3010 3.7733 3.8315 3.8760 3.9131 3.8930 3.8218 4.1659 3.6469 3.9677 4.2518 3.9580 3.8627 3.6556 4.0500 3.9494 3.6133 3.8765 3.6711 3.8917 3.9535 3.9267 3.9499 3.9004 1.0048 1.0314 1.0027 1.0197 0.9989 1.0069 1.0047 1.0047 1.0283 1.0030 1.0064 1.0124 1.0230 1.0114 0.9941 1.0141 1.0109 1.0173 1.0027 1.0141 1.0107 1.0017 1.0012 0.9995
dispcorr: -0.030894260 hartree
energy: -1590.109541208176
dipole: 9.49919 -9.94427 -0.44508 2.05213 -0.73115 1.32098 -16.76930 14.53157 -2.23773
magnitude: 2.63638 au
magnitude: 6.70116 debye
