program: Orca
programVersion: 5.0.2
elementType: S O O O O C C C C C C C C C C C C C C C C C C C C C C C H H H H H H H H H H H H H H H H H H H H H H H H
charge: 0
multiplicity: 1
keywords: wb97x-d3
keywords: def2-TZVPP
keywords: def2/J RIJCOSX
keywords: DEFGRID2
keywords: scfconv7
keywords: smallprint printgap noloewdin
keywords: NOSOSCF
formula: C23H24O4S
InChI: InChI=1/C23H24O4S/c1-23(2)19(12-17-8-9-28-22(17)25)20(23)21(24)27-14-16-11-18(26-13-16)10-15-6-4-3-5-7-15/h3-7,11-13,19-20H,8-10,14H2,1-2H3
52 atoms
S  -0.718607 -2.785176 1.394588
O  2.379217 1.502111 0.011777
O  2.227803 1.623102 -2.212918
O  0.832478 -1.270022 2.876599
O  -1.813262 0.653735 1.142369
C  4.930071 -0.093783 -0.313599
C  3.800079 -1.065111 -0.303642
C  3.779454 0.116868 -1.279508
C  5.186664 0.826056 0.854992
C  6.208998 -0.556641 -0.974037
C  2.819572 -1.159589 0.795159
C  2.731408 1.1556 -1.216453
C  1.638372 -1.769688 0.664373
C  1.06754 -2.360953 -0.58365
C  0.702176 -1.813869 1.806614
C  -0.0361 -3.346209 -0.195946
C  1.25989 2.385187 0.199511
C  -0.011142 1.620223 0.28409
C  -0.729224 0.952023 -0.763165
C  -0.720746 1.392796 1.413956
C  -1.810144 0.380156 -0.182466
C  -2.960311 -0.390987 -0.721865
C  -4.213615 0.450405 -0.782334
C  -4.543914 1.139356 -1.945893
C  -5.0324 0.590107 0.334971
C  -5.668912 1.951008 -1.994502
C  -6.155663 1.404802 0.290654
C  -6.476563 2.089554 -0.873932
H  3.973792 -2.009383 -0.813688
H  3.996543 -0.146928 -2.307934
H  5.855563 0.331357 1.562098
H  5.68549 1.736681 0.518375
H  4.29717 1.122683 1.40302
H  6.781159 0.292157 -1.353464
H  6.838506 -1.088893 -0.258356
H  6.018152 -1.229301 -1.811338
H  3.079854 -0.733482 1.758598
H  1.821489 -2.865182 -1.189203
H  0.646584 -1.559485 -1.197537
H  0.353301 -4.355474 -0.070121
H  -0.835848 -3.376357 -0.932916
H  1.457156 2.894207 1.141794
H  1.232648 3.137925 -0.588639
H  -0.479311 0.913218 -1.811424
H  -0.573907 1.691243 2.440636
H  -2.69509 -0.740207 -1.720591
H  -3.132199 -1.279291 -0.107936
H  -3.916087 1.038558 -2.823837
H  -4.793968 0.05661 1.247781
H  -5.914399 2.475839 -2.909253
H  -6.781576 1.505558 1.168402
H  -7.352822 2.724352 -0.909161
elementType: S O C H
totalener: -1648.76562267 hartree
nucrepener: 2818.25425659 hartree
electener: -4467.01987926 hartree
oneelecener: -7777.19686691 hartree
twoeener: 3310.17698765 hartree
cpcmener: -0.03685808 hartree
kineticenergy: 1584.22333352 hartree
xcener: -135.009550070959 hartree
chargesum: -0.0000000
charge: -0.066442 -0.260447 -0.473172 -0.428066 -0.271700 0.119224 -0.067466 -0.112566 -0.282065 -0.263312 -0.036509 0.413788 -0.156700 -0.121068 0.282614 -0.133411 0.047970 -0.048389 -0.335192 -0.033577 0.199378 -0.048929 0.068638 -0.202842 -0.211546 -0.152885 -0.155341 -0.171889 0.116952 0.093032 0.099334 0.103121 0.092519 0.098828 0.095024 0.087804 0.128208 0.104777 0.108764 0.127422 0.117809 0.110694 0.124103 0.158561 0.171966 0.107996 0.108104 0.139137 0.138683 0.156279 0.155766 0.157018
qa: -0.0664 -0.2604 -0.4732 -0.4281 -0.2717 0.1192 -0.0675 -0.1126 -0.2821 -0.2633 -0.0365 0.4138 -0.1567 -0.1211 0.2826 -0.1334 0.0480 -0.0484 -0.3352 -0.0336 0.1994 -0.0489 0.0686 -0.2028 -0.2115 -0.1529 -0.1553 -0.1719 0.1170 0.0930 0.0993 0.1031 0.0925 0.0988 0.0950 0.0878 0.1282 0.1048 0.1088 0.1274 0.1178 0.1107 0.1241 0.1586 0.1720 0.1080 0.1081 0.1391 0.1387 0.1563 0.1558 0.1570
va: 2.4288 2.1148 2.0282 2.0580 2.2590 3.7854 3.8348 3.8808 3.8958 3.9003 3.7463 4.1264 3.5873 3.9560 4.1624 3.9623 3.8645 3.5887 3.9704 3.9259 3.5995 3.7911 3.5896 3.9513 3.9644 3.8962 3.9023 3.9017 1.0055 1.0294 0.9993 1.0005 1.0134 1.0018 1.0024 1.0051 1.0229 1.0091 1.0138 1.0052 1.0045 1.0012 1.0073 1.0215 0.9974 1.0108 1.0154 1.0052 1.0114 0.9912 0.9914 0.9907
dispcorr: -0.031258966 hartree
energy: -1648.796881635176
dipole: 14.68569 -13.46839 1.21730 0.72340 -1.71569 -0.99230 -8.88748 7.50457 -1.38291
magnitude: 2.09258 au
magnitude: 5.31892 debye
