program: Orca
programVersion: 5.0.2
elementType: S O O O O C C C C C C C C C C C C C C C C C C C C C C C H H H H H H H H H H H H H H H H H H H H H H H H
charge: 0
multiplicity: 1
keywords: wb97x-d3
keywords: def2-TZVPP
keywords: def2/J RIJCOSX
keywords: DEFGRID2
keywords: scfconv7
keywords: smallprint printgap noloewdin
keywords: NOSOSCF
formula: C23H24O4S
InChI: InChI=1/C23H24O4S/c1-23(2)19(12-17-8-9-28-22(17)25)20(23)21(24)27-14-16-11-18(26-13-16)10-15-6-4-3-5-7-15/h3-7,11-13,19-20H,8-10,14H2,1-2H3
52 atoms
S  -1.249805 -2.277793 1.937983
O  2.455779 1.269312 0.457227
O  2.127294 2.387575 -1.447728
O  1.169723 -2.079867 2.931308
O  -1.698052 1.3451 1.676216
C  4.150867 -0.661258 -1.243144
C  2.796476 -1.238691 -1.023679
C  2.928847 0.178031 -1.578657
C  5.04119 -0.31614 -0.076108
C  4.923794 -1.15287 -2.444247
C  2.255537 -1.524209 0.319373
C  2.474779 1.383914 -0.860884
C  0.951492 -1.670119 0.567325
C  -0.170669 -1.441852 -0.39189
C  0.492264 -2.003389 1.929938
C  -1.419136 -2.153682 0.130963
C  1.804962 2.292022 1.237742
C  0.328787 2.115859 1.195218
C  -0.604881 2.619257 0.230856
C  -0.398634 1.350045 2.042834
C  -1.817366 2.12179 0.568519
C  -3.157543 2.221415 -0.062427
C  -3.527122 0.965448 -0.818809
C  -4.552177 0.135341 -0.379126
C  -2.830635 0.617554 -1.974746
C  -4.882509 -1.017201 -1.084024
C  -3.155592 -0.532022 -2.678895
C  -4.185529 -1.353935 -2.235349
H  2.442191 -1.932208 -1.782673
H  2.725994 0.264925 -2.63957
H  5.723456 0.490458 -0.348465
H  4.510711 -0.010711 0.821487
H  5.648814 -1.184435 0.184768
H  5.628215 -0.394981 -2.790971
H  5.494975 -2.047242 -2.189066
H  4.265488 -1.403864 -3.276497
H  2.95986 -1.663416 1.133278
H  0.064081 -1.792368 -1.397464
H  -0.361716 -0.366943 -0.468639
H  -1.511107 -3.158876 -0.276389
H  -2.329812 -1.604707 -0.09342
H  2.182473 2.142565 2.247035
H  2.11069 3.283602 0.905079
H  -0.400474 3.271805 -0.602552
H  -0.134682 0.792112 2.927898
H  -3.917856 2.439131 0.691102
H  -3.137897 3.071245 -0.74699
H  -5.101804 0.392938 0.518529
H  -2.02687 1.253684 -2.327829
H  -5.684109 -1.652191 -0.729267
H  -2.606497 -0.786185 -3.576503
H  -4.441091 -2.250861 -2.784411
elementType: S O C H
totalener: -1590.09424195 hartree
nucrepener: 2906.74894276 hartree
electener: -4496.84318471 hartree
oneelecener: -7953.61186939 hartree
twoeener: 3456.76868468 hartree
cpcmener: -0.04096811 hartree
kineticenergy: 1584.21868463 hartree
xcener: -135.014070482375 hartree
chargesum: 0.0000000
charge: -0.061393 -0.265801 -0.502107 -0.464025 -0.273834 0.114295 -0.042543 -0.119031 -0.288714 -0.265714 -0.046996 0.436561 -0.164806 -0.096352 0.284954 -0.062292 0.044264 -0.067351 -0.283085 -0.056235 0.186266 -0.061674 0.047071 -0.179992 -0.222754 -0.133583 -0.147009 -0.185725 0.120770 0.094985 0.104256 0.093582 0.102363 0.098127 0.095429 0.090025 0.128614 0.113588 0.080710 0.134422 0.048483 0.118547 0.126825 0.159213 0.178856 0.108050 0.118937 0.140900 0.146765 0.157341 0.158966 0.157850
qa: -0.0614 -0.2658 -0.5021 -0.4640 -0.2738 0.1143 -0.0425 -0.1190 -0.2887 -0.2657 -0.0470 0.4366 -0.1648 -0.0964 0.2850 -0.0623 0.0443 -0.0674 -0.2831 -0.0562 0.1863 -0.0617 0.0471 -0.1800 -0.2228 -0.1336 -0.1470 -0.1857 0.1208 0.0950 0.1043 0.0936 0.1024 0.0981 0.0954 0.0900 0.1286 0.1136 0.0807 0.1344 0.0485 0.1185 0.1268 0.1592 0.1789 0.1081 0.1189 0.1409 0.1468 0.1573 0.1590 0.1578
va: 2.4522 2.1166 1.9947 2.0177 2.2573 3.7814 3.8344 3.8933 3.9004 3.9027 3.7718 4.0848 3.5830 3.9594 4.1617 3.9619 3.8468 3.6376 3.9823 3.9395 3.6478 3.8163 3.5571 3.9045 3.8661 3.8427 3.8513 3.8770 1.0049 1.0290 1.0000 1.0121 0.9984 1.0016 1.0020 1.0052 1.0163 1.0083 1.0151 1.0068 1.0311 1.0009 1.0042 1.0179 0.9987 1.0118 1.0058 1.0038 1.0054 0.9908 0.9919 0.9917
dispcorr: -0.034471311 hartree
energy: -1590.128713262607
dipole: 11.09034 -11.18174 -0.09140 -1.54294 1.25837 -0.28457 -15.55620 13.51110 -2.04510
magnitude: 2.06682 au
magnitude: 5.25345 debye
