program: Orca
programVersion: 5.0.2
elementType: S O O O O C C C C C C C C C C C C C C C C C C C C C C C H H H H H H H H H H H H H H H H H H H H H H H H
charge: 0
multiplicity: 1
keywords: wb97x-d3
keywords: def2-TZVPP
keywords: def2/J RIJCOSX
keywords: DEFGRID2
keywords: scfconv7
keywords: smallprint printgap noloewdin
keywords: NOSOSCF
formula: C23H24O4S
InChI: InChI=1/C23H24O4S/c1-23(2)19(12-17-8-9-28-22(17)25)20(23)21(24)27-14-16-11-18(26-13-16)10-15-6-4-3-5-7-15/h3-7,11-13,19-20H,8-10,14H2,1-2H3
52 atoms
S  -1.118345 -1.964125 -2.102993
O  2.239576 1.231773 1.094322
O  3.186332 2.558064 -0.431173
O  -0.501313 -2.385788 0.417902
O  -1.247706 2.135108 -1.372901
C  4.549016 -0.695639 0.789676
C  3.576531 -1.050024 -0.285921
C  4.069255 0.396521 -0.141351
C  4.164671 -0.746385 2.248203
C  5.982255 -1.117774 0.558109
C  2.174445 -1.409623 -0.018964
C  3.136155 1.499149 0.158205
C  1.26558 -1.551691 -0.988911
C  1.463099 -1.321362 -2.453474
C  -0.09966 -2.002865 -0.658056
C  0.097154 -1.006463 -3.060157
C  1.203859 2.198407 1.35087
C  0.057601 2.024902 0.416801
C  -1.147521 1.288901 0.668568
C  -0.06362 2.512336 -0.840285
C  -1.908495 1.39423 -0.446378
C  -3.254842 0.891718 -0.834548
C  -4.020985 0.36114 0.345831
C  -4.944462 1.166714 1.005478
C  -3.813753 -0.936018 0.807404
C  -5.652383 0.686102 2.098832
C  -4.514623 -1.417882 1.904607
C  -5.438691 -0.608657 2.552345
H  3.990614 -1.529949 -1.167651
H  4.783873 0.693006 -0.89954
H  3.109139 -0.590372 2.447637
H  4.430033 -1.724945 2.651711
H  4.722989 0.001851 2.812755
H  6.13615 -2.14134 0.90366
H  6.255198 -1.07714 -0.496862
H  6.670241 -0.472908 1.10722
H  1.873634 -1.602553 1.004906
H  1.873913 -2.220275 -2.921213
H  2.157312 -0.503906 -2.650324
H  0.031056 -1.291239 -4.107397
H  -0.147366 0.050745 -2.9697
H  0.890072 2.000873 2.373607
H  1.610118 3.208355 1.313236
H  -1.403957 0.768072 1.577563
H  0.571056 3.125137 -1.460305
H  -3.817388 1.702523 -1.304665
H  -3.14769 0.109651 -1.592781
H  -5.116711 2.1776 0.655261
H  -3.103886 -1.578945 0.301989
H  -6.37333 1.323253 2.594457
H  -4.342897 -2.429379 2.249461
H  -5.99091 -0.985829 3.403239
elementType: S O C H
totalener: -1590.09309234 hartree
nucrepener: 2842.97035088 hartree
electener: -4433.06344322 hartree
oneelecener: -7826.84463973 hartree
twoeener: 3393.78119651 hartree
cpcmener: -0.04046533 hartree
kineticenergy: 1584.21461694 hartree
xcener: -135.010700763429 hartree
chargesum: -0.0000000
charge: -0.072081 -0.268270 -0.501020 -0.461448 -0.287233 0.134471 -0.074810 -0.100992 -0.279515 -0.263277 -0.055019 0.423170 -0.129828 -0.138722 0.299373 -0.118441 0.068744 -0.071991 -0.295143 -0.020087 0.174095 -0.048909 0.050478 -0.194780 -0.200223 -0.158343 -0.171164 -0.168312 0.120021 0.096914 0.090654 0.098259 0.105853 0.096120 0.090220 0.098591 0.128144 0.113245 0.096533 0.132231 0.115782 0.115135 0.126704 0.161713 0.166003 0.109587 0.116940 0.141788 0.127779 0.160358 0.159448 0.161257
qa: -0.0721 -0.2683 -0.5010 -0.4614 -0.2872 0.1345 -0.0748 -0.1010 -0.2795 -0.2633 -0.0550 0.4232 -0.1298 -0.1387 0.2994 -0.1184 0.0687 -0.0720 -0.2951 -0.0201 0.1741 -0.0489 0.0505 -0.1948 -0.2002 -0.1583 -0.1712 -0.1683 0.1200 0.0969 0.0907 0.0983 0.1059 0.0961 0.0902 0.0986 0.1281 0.1132 0.0965 0.1322 0.1158 0.1151 0.1267 0.1617 0.1660 0.1096 0.1169 0.1418 0.1278 0.1604 0.1594 0.1613
va: 2.4168 2.1195 1.9941 2.0120 2.2516 3.7856 3.8451 3.8909 3.8935 3.8974 3.7588 4.1209 3.6002 3.9923 4.1345 3.9174 3.7997 3.6272 3.9311 3.9227 3.6213 3.8221 3.5277 3.9578 3.8849 3.8869 3.9489 3.8912 1.0038 1.0289 1.0142 1.0002 0.9997 1.0022 1.0045 1.0015 1.0268 1.0041 1.0085 1.0121 1.0140 1.0003 1.0110 1.0043 1.0080 1.0169 1.0093 1.0037 1.0321 0.9896 0.9914 0.9889
dispcorr: -0.031642740 hartree
energy: -1590.124735084094
dipole: 14.70633 -13.14328 1.56305 -2.54121 2.46083 -0.08038 5.75229 -6.48224 -0.72995
magnitude: 1.72697 au
magnitude: 4.38961 debye
