program: Orca
programVersion: 5.0.2
elementType: S O O O O C C C C C C C C C C C C C C C C C C C C C C C H H H H H H H H H H H H H H H H H H H H H H H H
charge: 0
multiplicity: 1
keywords: wb97x-d3
keywords: def2-TZVPP
keywords: def2/J RIJCOSX
keywords: DEFGRID2
keywords: scfconv7
keywords: smallprint printgap noloewdin
keywords: NOSOSCF
formula: C23H24O4S
InChI: InChI=1/C23H24O4S/c1-23(2)19(12-17-8-9-28-22(17)25)20(23)21(24)27-14-16-11-18(26-13-16)10-15-6-4-3-5-7-15/h3-7,11-13,19-20H,8-10,14H2,1-2H3
52 atoms
S  -1.343675 -3.827299 0.312284
O  2.353344 2.59738 -0.482337
O  2.584937 1.205368 1.248128
O  0.233754 -2.721963 2.097243
O  -1.512762 2.552821 1.651982
C  4.153719 -0.614801 -0.716317
C  2.717809 -0.974295 -0.993189
C  3.168855 0.494015 -0.973248
C  4.774586 -0.845166 0.639609
C  5.124025 -0.873869 -1.844953
C  1.830126 -1.52109 0.031211
C  2.684908 1.427916 0.063467
C  0.848988 -2.40011 -0.210989
C  0.442591 -3.009221 -1.517095
C  0.031454 -2.894806 0.915871
C  -1.038718 -3.362867 -1.419947
C  1.756608 3.591111 0.37192
C  0.331898 3.269503 0.648141
C  -0.774727 3.40665 -0.252697
C  -0.18165 2.743428 1.783796
C  -1.868883 2.959249 0.405216
C  -3.291556 2.784653 0.013096
C  -3.622836 1.330677 -0.228207
C  -4.060067 0.513997 0.810855
C  -3.450472 0.773378 -1.492476
C  -4.315384 -0.8335 0.591813
C  -3.710389 -0.571516 -1.715625
C  -4.141302 -1.380899 -0.672065
H  2.524475 -1.328786 -1.998926
H  3.22021 0.938542 -1.959956
H  5.588494 -0.136936 0.801817
H  4.08948 -0.756318 1.476233
H  5.20257 -1.84812 0.670997
H  5.997069 -0.225282 -1.755289
H  5.472518 -1.907508 -1.81846
H  4.67382 -0.696593 -2.821794
H  1.972756 -1.203764 1.056944
H  1.024775 -3.917137 -1.694979
H  0.609643 -2.344944 -2.364195
H  -1.312239 -4.193279 -2.066177
H  -1.669684 -2.509088 -1.661836
H  2.329888 3.701274 1.292625
H  1.844288 4.518627 -0.19075
H  -0.749342 3.791818 -1.260069
H  0.257728 2.472323 2.730895
H  -3.947861 3.197758 0.783443
H  -3.462435 3.363325 -0.895285
H  -4.206165 0.934404 1.798715
H  -3.111745 1.39869 -2.31017
H  -4.652936 -1.45666 1.409869
H  -3.577768 -0.987486 -2.706079
H  -4.341497 -2.430513 -0.843725
elementType: S O C H
totalener: -1590.09753346 hartree
nucrepener: 2776.02942493 hartree
electener: -4366.12695839 hartree
oneelecener: -7693.66462656 hartree
twoeener: 3327.53766817 hartree
cpcmener: -0.04807312 hartree
kineticenergy: 1584.20661541 hartree
xcener: -135.007346273272 hartree
chargesum: 0.0000000
charge: -0.067284 -0.291588 -0.492971 -0.462497 -0.285926 0.091945 0.039659 -0.085084 -0.279238 -0.258597 -0.114983 0.424191 -0.168572 -0.128218 0.300468 -0.107912 0.098571 -0.081259 -0.345407 -0.017706 0.206543 -0.058521 0.064496 -0.204965 -0.206441 -0.145050 -0.136198 -0.217792 0.110718 0.101664 0.104464 0.097921 0.098505 0.096661 0.097267 0.090486 0.119035 0.108612 0.095434 0.123088 0.104892 0.120443 0.123230 0.163168 0.174361 0.116069 0.110446 0.142970 0.144611 0.158758 0.163153 0.164381
qa: -0.0673 -0.2916 -0.4930 -0.4625 -0.2859 0.0919 0.0397 -0.0851 -0.2792 -0.2586 -0.1150 0.4242 -0.1686 -0.1282 0.3005 -0.1079 0.0986 -0.0813 -0.3454 -0.0177 0.2065 -0.0585 0.0645 -0.2050 -0.2064 -0.1450 -0.1362 -0.2178 0.1107 0.1017 0.1045 0.0979 0.0985 0.0967 0.0973 0.0905 0.1190 0.1086 0.0954 0.1231 0.1049 0.1204 0.1232 0.1632 0.1744 0.1161 0.1104 0.1430 0.1446 0.1588 0.1632 0.1644
va: 2.4259 2.1275 1.9979 2.0221 2.2694 3.7589 3.7830 3.8838 3.8974 3.9071 3.8265 4.0820 3.6856 3.9934 4.1661 3.9322 3.8126 3.6153 4.0123 3.9483 3.6163 3.8203 3.5636 3.9641 3.9467 3.8642 3.8267 3.8633 1.0080 1.0289 0.9980 1.0130 1.0005 1.0019 1.0018 1.0051 1.0439 1.0025 1.0088 1.0088 1.0191 1.0094 0.9929 1.0071 1.0014 1.0070 1.0097 1.0075 1.0027 0.9914 0.9890 0.9891
dispcorr: -0.027322012 hartree
energy: -1590.124855469964
dipole: 13.11750 -12.40218 0.71532 -0.33625 1.22990 0.89365 -13.30321 9.43657 -3.86664
magnitude: 4.03251 au
magnitude: 10.24983 debye
