program: Orca
programVersion: 5.0.2
elementType: S O O O O C C C C C C C C C C C C C C C C C C C C C C C H H H H H H H H H H H H H H H H H H H H H H H H
charge: 0
multiplicity: 1
keywords: wb97x-d3
keywords: def2-TZVPP
keywords: def2/J RIJCOSX
keywords: DEFGRID2
keywords: scfconv7
keywords: smallprint printgap noloewdin
keywords: NOSOSCF
formula: C23H24O4S
InChI: InChI=1/C23H24O4S/c1-23(2)19(12-17-8-9-28-22(17)25)20(23)21(24)27-14-16-11-18(26-13-16)10-15-6-4-3-5-7-15/h3-7,11-13,19-20H,8-10,14H2,1-2H3
52 atoms
S  -1.601003 -2.169491 -1.054692
O  2.069105 1.307708 -1.420973
O  3.360069 2.333146 0.090906
O  -0.656716 -1.728197 1.362788
O  -0.719079 2.694218 1.706416
C  4.484754 -0.563054 0.52602
C  3.35563 -1.209985 -0.242076
C  3.927877 0.133005 -0.670739
C  4.236159 -0.031238 1.916538
C  5.848155 -1.190833 0.365141
C  1.98718 -1.294625 0.288425
C  3.104724 1.370885 -0.59327
C  0.954404 -1.759211 -0.422414
C  0.968947 -2.212667 -1.846761
C  -0.38701 -1.844704 0.187674
C  -0.42047 -1.948672 -2.422362
C  1.138955 2.408697 -1.434181
C  0.207491 2.3418 -0.277661
C  -0.965425 1.524254 -0.156657
C  0.303462 3.023696 0.886561
C  -1.491952 1.776744 1.064407
C  -2.6786 1.284484 1.817157
C  -3.612332 0.440417 0.991461
C  -4.223337 0.958912 -0.148891
C  -3.914059 -0.861889 1.374922
C  -5.103447 0.187529 -0.893349
C  -4.800225 -1.63476 0.635938
C  -5.395222 -1.113684 -0.502714
H  3.632775 -2.026927 -0.900303
H  4.520033 0.099379 -1.581988
H  3.258199 0.427389 2.052097
H  4.320932 -0.841854 2.641969
H  4.984724 0.719203 2.173645
H  6.635927 -0.459922 0.555707
H  5.97923 -2.013457 1.070131
H  5.996797 -1.586168 -0.640527
H  1.803315 -0.958954 1.304322
H  1.190927 -3.281973 -1.8968
H  1.723114 -1.694521 -2.438652
H  -0.67464 -2.63416 -3.227089
H  -0.509227 -0.928836 -2.794404
H  1.673459 3.358272 -1.465045
H  0.599297 2.29543 -2.372348
H  -1.361287 0.849646 -0.899512
H  1.005327 3.754907 1.255562
H  -2.345175 0.713298 2.688599
H  -3.22375 2.146758 2.215116
H  -4.011457 1.975706 -0.458039
H  -3.456093 -1.276546 2.264437
H  -5.568442 0.605394 -1.777044
H  -5.021117 -2.646593 0.950776
H  -6.08386 -1.714675 -1.082434
elementType: S O C H
totalener: -1590.09248427 hartree
nucrepener: 2880.30376497 hartree
electener: -4470.39624925 hartree
oneelecener: -7902.38046860 hartree
twoeener: 3431.98421935 hartree
cpcmener: -0.04364712 hartree
kineticenergy: 1584.20747223 hartree
xcener: -135.009919691771 hartree
chargesum: 0.0000000
charge: -0.075679 -0.275703 -0.472774 -0.469998 -0.289144 0.117452 -0.060901 -0.081309 -0.291357 -0.265141 -0.090631 0.402929 -0.110364 -0.153473 0.306589 -0.104043 0.065259 -0.064088 -0.364860 -0.022954 0.254054 -0.055577 0.090558 -0.253457 -0.232909 -0.138424 -0.138139 -0.179761 0.115860 0.115000 0.082871 0.105402 0.103358 0.097031 0.094899 0.089621 0.131901 0.112650 0.093376 0.128304 0.114931 0.128148 0.124159 0.158864 0.172592 0.107878 0.118543 0.147072 0.135204 0.159858 0.156722 0.159601
qa: -0.0757 -0.2757 -0.4728 -0.4700 -0.2891 0.1175 -0.0609 -0.0813 -0.2914 -0.2651 -0.0906 0.4029 -0.1104 -0.1535 0.3066 -0.1040 0.0653 -0.0641 -0.3649 -0.0230 0.2541 -0.0556 0.0906 -0.2535 -0.2329 -0.1384 -0.1381 -0.1798 0.1159 0.1150 0.0829 0.1054 0.1034 0.0970 0.0949 0.0896 0.1319 0.1126 0.0934 0.1283 0.1149 0.1281 0.1242 0.1589 0.1726 0.1079 0.1185 0.1471 0.1352 0.1599 0.1567 0.1596
va: 2.4368 2.1175 2.0170 2.0079 2.2689 3.8193 3.8295 3.8628 3.9153 3.8873 3.7918 4.1460 3.5625 4.0029 4.1442 3.9332 3.7990 3.6550 3.9820 3.9693 3.5790 3.8360 3.4731 3.9338 3.9020 3.8701 3.8446 3.8902 1.0024 1.0148 1.0043 1.0016 1.0029 1.0019 1.0024 1.0038 1.0237 1.0040 1.0124 1.0121 1.0047 1.0083 0.9965 1.0151 1.0039 1.0099 1.0042 1.0012 1.0176 0.9887 0.9912 0.9883
dispcorr: -0.032917975 hartree
energy: -1590.125402248584
dipole: 14.30099 -13.13398 1.16701 -4.46765 3.76038 -0.70727 -1.98630 -0.72934 -2.71564
magnitude: 3.03922 au
magnitude: 7.72508 debye
