program: Orca
programVersion: 5.0.2
elementType: S O O O O C C C C C C C C C C C C C C C C C C C C C C C H H H H H H H H H H H H H H H H H H H H H H H H
charge: 0
multiplicity: 1
keywords: wb97x-d3
keywords: def2-TZVPP
keywords: def2/J RIJCOSX
keywords: DEFGRID2
keywords: scfconv7
keywords: smallprint printgap noloewdin
keywords: NOSOSCF
formula: C23H24O4S
InChI: InChI=1/C23H24O4S/c1-23(2)19(12-17-8-9-28-22(17)25)20(23)21(24)27-14-16-11-18(26-13-16)10-15-6-4-3-5-7-15/h3-7,11-13,19-20H,8-10,14H2,1-2H3
52 atoms
S  -1.481749 -3.248984 -2.831567
O  2.373664 1.763395 -1.004237
O  3.228751 2.26945 0.997889
O  -1.203047 -0.645207 -2.649144
O  -0.871376 3.472141 1.288614
C  2.341975 -0.748613 1.357095
C  2.303807 -1.141326 -0.114007
C  3.174001 -0.000617 0.362975
C  1.132164 -0.081294 1.965649
C  3.046891 -1.688173 2.30042
C  1.078541 -0.984373 -0.898961
C  2.92518 1.452291 0.159771
C  0.505896 -1.978247 -1.591241
C  0.949093 -3.404019 -1.709938
C  -0.731222 -1.721219 -2.351962
C  -0.310286 -4.252897 -1.864811
C  1.830443 3.09574 -1.150337
C  0.563651 3.179722 -0.378903
C  -0.665862 2.519462 -0.69985
C  0.375998 3.739342 0.839006
C  -1.497954 2.71846 0.347719
C  -2.842762 2.172703 0.67483
C  -2.713709 0.79156 1.275101
C  -2.74783 -0.329949 0.451144
C  -2.493833 0.617056 2.638737
C  -2.562719 -1.602402 0.974554
C  -2.318048 -0.65554 3.167285
C  -2.348074 -1.768693 2.336728
H  2.872756 -2.03495 -0.344306
H  4.237956 -0.220682 0.379396
H  1.419083 0.479872 2.856653
H  0.620288 0.610774 1.296388
H  0.405965 -0.835425 2.271182
H  3.411208 -1.14881 3.176989
H  2.36697 -2.467064 2.650271
H  3.900819 -2.174637 1.828206
H  0.577902 -0.023716 -0.892174
H  1.519202 -3.743438 -0.846206
H  1.583113 -3.527946 -2.591939
H  -0.759617 -4.480974 -0.899236
H  -0.120794 -5.18599 -2.390324
H  2.554345 3.849001 -0.841012
H  1.66005 3.205514 -2.219213
H  -0.884296 1.945207 -1.586797
H  1.006862 4.335527 1.479526
H  -3.366558 2.843535 1.358905
H  -3.43224 2.122656 -0.241763
H  -2.930267 -0.205001 -0.609158
H  -2.462777 1.480262 3.293354
H  -2.591533 -2.463079 0.317094
H  -2.150693 -0.777582 4.229876
H  -2.205819 -2.759339 2.748755
elementType: S O C H
totalener: -1590.09311817 hartree
nucrepener: 2903.68717575 hartree
electener: -4493.78029392 hartree
oneelecener: -7948.41855464 hartree
twoeener: 3454.63826072 hartree
cpcmener: -0.04211212 hartree
kineticenergy: 1584.19960518 hartree
xcener: -135.007096412098 hartree
chargesum: 0.0000000
charge: -0.063442 -0.272418 -0.474632 -0.463463 -0.278935 0.119847 0.000865 -0.064206 -0.259525 -0.265551 -0.091956 0.355802 -0.111718 -0.136685 0.264651 -0.121003 0.082785 -0.058760 -0.344912 -0.029026 0.209245 -0.045778 0.063717 -0.205779 -0.204386 -0.156147 -0.157477 -0.176316 0.115585 0.117293 0.114445 0.035236 0.111030 0.095891 0.094284 0.091930 0.110956 0.090798 0.105937 0.116313 0.125600 0.121789 0.123361 0.165975 0.174604 0.110229 0.111797 0.144239 0.139507 0.151834 0.157889 0.158679
qa: -0.0634 -0.2724 -0.4746 -0.4635 -0.2789 0.1198 0.0009 -0.0642 -0.2595 -0.2656 -0.0920 0.3558 -0.1117 -0.1367 0.2647 -0.1210 0.0828 -0.0588 -0.3449 -0.0290 0.2092 -0.0458 0.0637 -0.2058 -0.2044 -0.1561 -0.1575 -0.1763 0.1156 0.1173 0.1144 0.0352 0.1110 0.0959 0.0943 0.0919 0.1110 0.0908 0.1059 0.1163 0.1256 0.1218 0.1234 0.1660 0.1746 0.1102 0.1118 0.1442 0.1395 0.1518 0.1579 0.1587
va: 2.4286 2.1312 2.0119 2.0139 2.2646 3.7614 3.7103 3.8755 3.9261 3.8961 3.8652 4.2246 3.5574 3.9773 4.1619 3.9391 3.8263 3.6588 3.9253 3.9415 3.6324 3.8119 3.5801 3.8732 3.9134 3.8378 3.8563 3.8685 1.0044 1.0122 1.0093 0.9898 1.0031 1.0022 1.0010 1.0051 0.9778 1.0117 1.0021 1.0037 1.0101 1.0093 0.9945 1.0245 1.0008 1.0149 1.0088 1.0157 1.0087 0.9969 0.9902 0.9906
dispcorr: -0.034892249 hartree
energy: -1590.128010418108
dipole: 6.64321 -5.48782 1.15539 -9.91841 7.71593 -2.20247 13.64721 -13.04900 0.59821
magnitude: 2.55806 au
magnitude: 6.50207 debye
