program: Orca
programVersion: 5.0.2
elementType: S O O O O C C C C C C C C C C C C C C C C C C C C C C C H H H H H H H H H H H H H H H H H H H H H H H H
charge: 0
multiplicity: 1
keywords: wb97x-d3
keywords: def2-TZVPP
keywords: def2/J RIJCOSX
keywords: DEFGRID2
keywords: scfconv7
keywords: smallprint printgap noloewdin
keywords: NOSOSCF
formula: C23H24O4S
InChI: InChI=1/C23H24O4S/c1-23(2)19(12-17-8-9-28-22(17)25)20(23)21(24)27-14-16-11-18(26-13-16)10-15-6-4-3-5-7-15/h3-7,11-13,19-20H,8-10,14H2,1-2H3
52 atoms
S  -1.734389 -3.179919 0.502588
O  2.510061 2.598603 -0.59042
O  3.092448 1.395538 1.202363
O  -0.446483 -1.469598 2.011182
O  -1.757112 3.274165 0.222568
C  4.0621 -0.794724 -0.724421
C  2.581707 -0.850525 -1.013738
C  3.342467 0.487819 -1.00917
C  4.601438 -1.155972 0.639052
C  4.959707 -1.272219 -1.842771
C  1.585815 -1.136969 0.017719
C  2.992617 1.507738 0.002285
C  0.474986 -1.857857 -0.180593
C  0.023257 -2.525118 -1.44161
C  -0.480202 -2.026951 0.933326
C  -0.954137 -3.643687 -1.072352
C  1.884218 3.605135 0.229672
C  0.453784 3.260972 0.446915
C  -0.103025 2.190035 1.223776
C  -0.601481 3.875011 -0.136267
C  -1.442809 2.239034 1.046392
C  -2.545981 1.359636 1.496098
C  -3.110117 0.466725 0.409709
C  -4.318947 -0.189538 0.634581
C  -2.454386 0.253016 -0.798382
C  -4.858183 -1.038194 -0.319802
C  -3.000781 -0.585807 -1.76219
C  -4.200472 -1.238001 -1.52679
H  2.316974 -1.178867 -2.011955
H  3.481312 0.897181 -2.003191
H  5.515328 -0.59772 0.847103
H  3.913929 -0.985178 1.461188
H  4.859272 -2.216083 0.645199
H  5.9541 -0.83204 -1.749373
H  5.070112 -2.357074 -1.808479
H  4.567137 -1.005884 -2.824603
H  1.749311 -0.736391 1.011288
H  0.854588 -2.940448 -2.010605
H  -0.475497 -1.798777 -2.086578
H  -0.440475 -4.594001 -0.936925
H  -1.72929 -3.774822 -1.82394
H  2.428207 3.732225 1.165189
H  1.971272 4.530274 -0.337176
H  0.421085 1.46945 1.830511
H  -0.676483 4.72498 -0.796925
H  -2.166092 0.740346 2.311532
H  -3.355811 1.955398 1.926607
H  -4.84559 -0.03148 1.568974
H  -1.507939 0.738415 -1.00448
H  -5.796596 -1.540662 -0.122394
H  -2.480595 -0.729026 -2.70088
H  -4.622202 -1.89413 -2.277125
elementType: S O C H
totalener: -1590.09595569 hartree
nucrepener: 2876.23777634 hartree
electener: -4466.33373203 hartree
oneelecener: -7894.02797214 hartree
twoeener: 3427.69424011 hartree
cpcmener: -0.04367453 hartree
kineticenergy: 1584.20137647 hartree
xcener: -135.012346831528 hartree
chargesum: 0.0000000
charge: -0.053266 -0.284641 -0.482262 -0.477633 -0.290412 0.111459 0.048573 -0.098506 -0.274505 -0.263875 -0.152880 0.416433 -0.161120 -0.150694 0.315219 -0.120505 0.071171 -0.075279 -0.322001 -0.036008 0.239362 -0.053448 0.045144 -0.203443 -0.170847 -0.153030 -0.200260 -0.173368 0.113562 0.106227 0.104451 0.094548 0.095593 0.096917 0.097139 0.090719 0.127790 0.110019 0.115202 0.127738 0.116206 0.119640 0.119697 0.156973 0.176808 0.106502 0.115616 0.140476 0.136821 0.159445 0.162963 0.159568
qa: -0.0533 -0.2846 -0.4823 -0.4776 -0.2904 0.1115 0.0486 -0.0985 -0.2745 -0.2639 -0.1529 0.4164 -0.1611 -0.1507 0.3152 -0.1205 0.0712 -0.0753 -0.3220 -0.0360 0.2394 -0.0534 0.0451 -0.2034 -0.1708 -0.1530 -0.2003 -0.1734 0.1136 0.1062 0.1045 0.0945 0.0956 0.0969 0.0971 0.0907 0.1278 0.1100 0.1152 0.1277 0.1162 0.1196 0.1197 0.1570 0.1768 0.1065 0.1156 0.1405 0.1368 0.1594 0.1630 0.1596
va: 2.4522 2.1208 2.0102 2.0010 2.2670 3.7481 3.7878 3.8846 3.8941 3.9062 3.8017 4.1057 3.6382 3.9786 4.1554 3.9448 3.8497 3.7222 3.9773 3.9673 3.5763 3.8545 3.5911 3.9566 3.8011 3.8712 3.8844 3.8709 1.0053 1.0265 0.9997 1.0105 1.0017 1.0016 1.0020 1.0044 1.0234 1.0063 1.0011 1.0070 1.0087 1.0102 0.9972 1.0274 0.9945 1.0119 1.0085 1.0007 1.0017 0.9874 0.9865 0.9887
dispcorr: -0.032960819 hartree
energy: -1590.128916505773
dipole: 14.14540 -13.22351 0.92188 -7.35598 6.70073 -0.65525 -10.56425 7.30737 -3.25688
magnitude: 3.44768 au
magnitude: 8.76331 debye
