program: Orca
programVersion: 5.0.2
elementType: S O O O O C C C C C C C C C C C C C C C C C C C C C C C H H H H H H H H H H H H H H H H H H H H H H H H
charge: 0
multiplicity: 1
keywords: wb97x-d3
keywords: def2-TZVPP
keywords: def2/J RIJCOSX
keywords: DEFGRID2
keywords: scfconv7
keywords: smallprint printgap noloewdin
keywords: NOSOSCF
formula: C23H24O4S
InChI: InChI=1/C23H24O4S/c1-23(2)19(12-17-8-9-28-22(17)25)20(23)21(24)27-14-16-11-18(26-13-16)10-15-6-4-3-5-7-15/h3-7,11-13,19-20H,8-10,14H2,1-2H3
52 atoms
S  -1.383737 -3.074309 1.664108
O  2.108897 2.463896 -1.304003
O  3.172033 1.893221 0.574483
O  -0.01403 -1.043115 2.603157
O  -0.864119 2.378725 1.977872
C  3.98606 -0.72903 -0.801325
C  2.486009 -0.899997 -0.92123
C  3.172193 0.412227 -1.32147
C  4.647326 -0.73054 0.556153
C  4.804851 -1.449462 -1.846687
C  1.617736 -0.960018 0.25369
C  2.85373 1.642671 -0.563892
C  0.688755 -1.90141 0.464909
C  0.382657 -3.100996 -0.375729
C  -0.136445 -1.825718 1.686217
C  -1.029389 -3.587877 -0.044734
C  1.4412 3.540529 -0.620067
C  0.349295 2.993185 0.226116
C  -0.765269 2.213817 -0.228042
C  0.239123 3.0497 1.571321
C  -1.46823 1.864555 0.874642
C  -2.709545 1.075576 1.103955
C  -3.289363 0.524978 -0.17006
C  -2.568899 -0.381213 -0.946142
C  -4.56049 0.899441 -0.591398
C  -3.106148 -0.898865 -2.114944
C  -5.10478 0.379367 -1.75971
C  -4.378091 -0.519325 -2.526496
H  2.157891 -1.49662 -1.765075
H  3.200098 0.566055 -2.394638
H  5.561579 -0.135704 0.537204
H  4.023212 -0.359203 1.362813
H  4.929681 -1.753906 0.807951
H  5.776941 -0.968239 -1.969056
H  4.97958 -2.485059 -1.55123
H  4.311708 -1.456506 -2.819194
H  1.722267 -0.190074 1.011154
H  1.102222 -3.891892 -0.150693
H  0.459495 -2.892423 -1.442855
H  -1.115244 -4.669629 -0.113643
H  -1.775774 -3.142484 -0.700015
H  2.144791 4.135945 -0.037051
H  1.051272 4.167523 -1.420112
H  -0.997643 1.955881 -1.24881
H  0.840216 3.511302 2.339124
H  -2.493605 0.255188 1.796683
H  -3.453371 1.702211 1.604081
H  -1.572906 -0.678195 -0.639365
H  -5.133648 1.602823 0.000825
H  -2.529495 -1.598809 -2.706215
H  -6.097395 0.679698 -2.069437
H  -4.799165 -0.923827 -3.437616
elementType: S O C H
totalener: -1590.09585634 hartree
nucrepener: 2858.38769009 hartree
electener: -4448.48354643 hartree
oneelecener: -7857.88092267 hartree
twoeener: 3409.39737624 hartree
cpcmener: -0.04728464 hartree
kineticenergy: 1584.20027494 hartree
xcener: -135.009907915037 hartree
chargesum: -0.0000000
charge: -0.056879 -0.285363 -0.469631 -0.464426 -0.285889 0.137489 0.015676 -0.104484 -0.272802 -0.267027 -0.120277 0.386462 -0.129903 -0.134814 0.264969 -0.127986 0.096797 -0.069529 -0.314601 -0.039210 0.182384 -0.027529 0.021578 -0.224814 -0.159868 -0.176291 -0.162378 -0.166337 0.113578 0.109965 0.104578 0.093930 0.094960 0.097544 0.096958 0.090857 0.122261 0.115656 0.099513 0.130318 0.116347 0.119322 0.124245 0.159872 0.177609 0.102540 0.108568 0.157162 0.142069 0.157508 0.159336 0.159989
qa: -0.0569 -0.2854 -0.4696 -0.4644 -0.2859 0.1375 0.0157 -0.1045 -0.2728 -0.2670 -0.1203 0.3865 -0.1299 -0.1348 0.2650 -0.1280 0.0968 -0.0695 -0.3146 -0.0392 0.1824 -0.0275 0.0216 -0.2248 -0.1599 -0.1763 -0.1624 -0.1663 0.1136 0.1100 0.1046 0.0939 0.0950 0.0975 0.0970 0.0909 0.1223 0.1157 0.0995 0.1303 0.1163 0.1193 0.1242 0.1599 0.1776 0.1025 0.1086 0.1572 0.1421 0.1575 0.1593 0.1600
va: 2.4403 2.1101 2.0246 2.0146 2.2496 3.7415 3.8068 3.8846 3.8961 3.9078 3.7651 4.1589 3.6394 3.9752 4.1640 3.9393 3.8290 3.6575 3.9385 3.9614 3.6361 3.8238 3.5752 3.8469 3.9113 3.9375 3.8912 3.8987 1.0056 1.0245 1.0004 1.0098 1.0016 1.0015 1.0022 1.0044 1.0242 0.9999 1.0104 1.0110 1.0077 1.0076 0.9909 1.0082 0.9961 1.0147 1.0162 0.9870 1.0027 0.9924 0.9900 0.9897
dispcorr: -0.031767870 hartree
energy: -1590.127624211834
dipole: 11.12220 -10.87011 0.25209 -7.60687 6.29185 -1.31502 -14.21759 10.70871 -3.50889
magnitude: 3.75568 au
magnitude: 9.54617 debye
