program: Orca
programVersion: 5.0.2
elementType: S O O O O C C C C C C C C C C C C C C C C C C C C C C C H H H H H H H H H H H H H H H H H H H H H H H H
charge: 0
multiplicity: 1
keywords: wb97x-d3
keywords: def2-TZVPP
keywords: def2/J RIJCOSX
keywords: DEFGRID2
keywords: scfconv7
keywords: smallprint printgap noloewdin
keywords: NOSOSCF
formula: C23H24O4S
InChI: InChI=1/C23H24O4S/c1-23(2)19(12-17-8-9-28-22(17)25)20(23)21(24)27-14-16-11-18(26-13-16)10-15-6-4-3-5-7-15/h3-7,11-13,19-20H,8-10,14H2,1-2H3
52 atoms
S  -0.806722 -2.57258 1.895407
O  1.803185 1.997318 -1.279954
O  3.012298 1.669764 0.568696
O  1.291588 -1.522609 3.075327
O  -1.122722 1.089661 1.848086
C  4.619993 -0.455638 -0.968479
C  3.292865 -1.111543 -0.783026
C  3.380804 0.308068 -1.368911
C  5.480273 -0.066236 0.208915
C  5.441595 -0.948698 -2.138305
C  2.657724 -1.305834 0.532733
C  2.756694 1.38539 -0.579086
C  1.373227 -1.649133 0.6699
C  0.365082 -1.847087 -0.415031
C  0.791304 -1.829234 2.017195
C  -0.688256 -2.828668 0.097148
C  0.943064 2.911686 -0.571334
C  -0.082662 2.172448 0.214061
C  -1.346384 1.694838 -0.268473
C  -0.006007 1.76844 1.504177
C  -1.937354 1.045691 0.762303
C  -3.230218 0.327438 0.924543
C  -4.08113 0.42839 -0.310876
C  -5.143493 1.324174 -0.368054
C  -3.805716 -0.356908 -1.427921
C  -5.917876 1.434184 -1.515933
C  -4.573194 -0.246107 -2.578184
C  -5.632779 0.651423 -2.625499
H  3.009593 -1.848497 -1.528745
H  3.181322 0.361592 -2.432493
H  4.932843 0.213163 1.102709
H  6.125254 -0.907009 0.468762
H  6.127036 0.770381 -0.057819
H  4.816079 -1.246006 -2.980805
H  6.124745 -0.172227 -2.485983
H  6.039561 -1.813081 -1.845234
H  3.260696 -1.174769 1.424764
H  0.807419 -2.221576 -1.337942
H  -0.105885 -0.887076 -0.648202
H  -0.397721 -3.861763 -0.087605
H  -1.665051 -2.657852 -0.34953
H  1.529483 3.582741 0.055596
H  0.473452 3.506204 -1.352354
H  -1.75061 1.832776 -1.25883
H  0.73635 1.892251 2.276054
H  -3.031531 -0.723351 1.161093
H  -3.771162 0.73659 1.78228
H  -5.370434 1.938677 0.49491
H  -2.983169 -1.06253 -1.39721
H  -6.74456 2.132307 -1.54133
H  -4.345616 -0.863653 -3.437329
H  -6.234819 0.73634 -3.520675
elementType: S O C H
totalener: -1590.09469596 hartree
nucrepener: 2831.21269427 hartree
electener: -4421.30739023 hartree
oneelecener: -7802.94454640 hartree
twoeener: 3381.63715617 hartree
cpcmener: -0.04575449 hartree
kineticenergy: 1584.20745644 hartree
xcener: -135.009180324739 hartree
chargesum: 0.0000000
charge: -0.066174 -0.287759 -0.485900 -0.456828 -0.281024 0.130330 -0.067150 -0.079904 -0.284609 -0.263628 -0.065390 0.394506 -0.141589 -0.091655 0.280284 -0.142036 0.084203 -0.084634 -0.286574 -0.018806 0.151717 -0.013508 0.028755 -0.192525 -0.220965 -0.157982 -0.161702 -0.168481 0.118432 0.097052 0.089864 0.098802 0.103776 0.089618 0.098578 0.096654 0.132500 0.106902 0.094711 0.133802 0.122098 0.122005 0.122058 0.157339 0.170308 0.109598 0.110619 0.140883 0.154876 0.159683 0.158279 0.160593
qa: -0.0662 -0.2878 -0.4859 -0.4568 -0.2810 0.1303 -0.0672 -0.0799 -0.2846 -0.2636 -0.0654 0.3945 -0.1416 -0.0917 0.2803 -0.1420 0.0842 -0.0846 -0.2866 -0.0188 0.1517 -0.0135 0.0288 -0.1925 -0.2210 -0.1580 -0.1617 -0.1685 0.1184 0.0971 0.0899 0.0988 0.1038 0.0896 0.0986 0.0967 0.1325 0.1069 0.0947 0.1338 0.1221 0.1220 0.1221 0.1573 0.1703 0.1096 0.1106 0.1409 0.1549 0.1597 0.1583 0.1606
va: 2.4309 2.1163 2.0002 2.0214 2.2501 3.7891 3.8441 3.8540 3.8839 3.8978 3.7663 4.1305 3.5715 3.9498 4.1511 3.9639 3.8143 3.6287 3.9290 3.9090 3.6543 3.8081 3.5704 3.9578 3.8993 3.8883 3.9284 3.8885 1.0066 1.0308 1.0197 1.0001 0.9989 1.0041 1.0021 1.0023 1.0193 1.0117 1.0227 1.0074 1.0021 1.0108 0.9933 1.0052 1.0087 1.0138 1.0149 1.0042 0.9931 0.9899 0.9920 0.9893
dispcorr: -0.031570098 hartree
energy: -1590.126266061503
dipole: 10.16294 -10.66613 -0.50319 -1.57675 1.02251 -0.55424 -16.55267 12.81247 -3.74020
magnitude: 3.81437 au
magnitude: 9.69537 debye
