program: Orca
programVersion: 5.0.2
elementType: S O O O O C C C C C C C C C C C C C C C C C C C C C C C H H H H H H H H H H H H H H H H H H H H H H H H
charge: 0
multiplicity: 1
keywords: wb97x-d3
keywords: def2-TZVPP
keywords: def2/J RIJCOSX
keywords: DEFGRID2
keywords: scfconv7
keywords: smallprint printgap noloewdin
keywords: NOSOSCF
formula: C23H24O4S
InChI: InChI=1/C23H24O4S/c1-23(2)19(12-17-8-9-28-22(17)25)20(23)21(24)27-14-16-11-18(26-13-16)10-15-6-4-3-5-7-15/h3-7,11-13,19-20H,8-10,14H2,1-2H3
52 atoms
S  -1.343584 -4.209558 -0.561153
O  2.40015 2.560528 -0.148467
O  1.914438 1.035788 1.413784
O  -0.391201 -3.002241 1.567872
O  -1.633061 4.427516 -0.615337
C  4.015395 -0.710062 -0.101169
C  2.698348 -1.048028 -0.749005
C  3.124174 0.412996 -0.567245
C  4.254386 -0.981867 1.363144
C  5.247309 -0.939684 -0.943674
C  1.597981 -1.650351 0.001091
C  2.41772 1.326496 0.352244
C  0.737422 -2.54044 -0.511093
C  0.690509 -3.087566 -1.904456
C  -0.276271 -3.151534 0.371918
C  -0.724968 -3.599206 -2.158625
C  1.71825 3.594112 0.584055
C  0.281144 3.661201 0.211164
C  -0.75063 2.690853 0.442205
C  -0.316604 4.685759 -0.437328
C  -1.887551 3.20486 -0.080907
C  -3.288656 2.707155 -0.155485
C  -3.362674 1.254802 0.226614
C  -3.284388 0.263787 -0.74706
C  -3.464467 0.877117 1.562061
C  -3.309078 -1.078393 -0.394772
C  -3.48557 -0.464683 1.918401
C  -3.407769 -1.446432 0.940343
H  2.770967 -1.365253 -1.782877
H  3.433424 0.88637 -1.491148
H  5.013039 -0.300369 1.750531
H  3.375749 -0.886397 1.993056
H  4.634754 -1.9971 1.483269
H  6.062877 -0.293488 -0.614699
H  5.5838 -1.973553 -0.852021
H  5.064829 -0.738543 -1.999453
H  1.484505 -1.389908 1.04581
H  1.398601 -3.9147 -1.999387
H  0.955932 -2.345504 -2.656808
H  -0.748411 -4.40811 -2.884914
H  -1.384888 -2.803667 -2.502813
H  1.853517 3.45006 1.656048
H  2.221784 4.518407 0.306006
H  -0.653929 1.737207 0.93376
H  0.053301 5.626222 -0.815053
H  -3.928087 3.30326 0.502944
H  -3.671676 2.848075 -1.16959
H  -3.204932 0.545219 -1.790345
H  -3.526598 1.639443 2.329665
H  -3.254588 -1.837045 -1.164747
H  -3.565194 -0.743623 2.961042
H  -3.428007 -2.492748 1.215748
elementType: S O C H
totalener: -1590.09769284 hartree
nucrepener: 2778.57016969 hartree
electener: -4368.66786253 hartree
oneelecener: -7698.78404284 hartree
twoeener: 3330.11618032 hartree
cpcmener: -0.04648308 hartree
kineticenergy: 1584.21060926 hartree
xcener: -135.010500290473 hartree
chargesum: -0.0000000
charge: -0.065610 -0.288355 -0.500032 -0.462587 -0.288889 0.090542 0.041646 -0.082961 -0.279276 -0.258705 -0.102787 0.439487 -0.167776 -0.133989 0.296827 -0.125606 0.083793 -0.124522 -0.262549 -0.034939 0.171677 0.007588 0.011978 -0.208019 -0.201500 -0.144232 -0.149235 -0.177810 0.113674 0.103178 0.104824 0.097030 0.100005 0.097008 0.096734 0.090749 0.118180 0.109899 0.095056 0.126613 0.115932 0.118633 0.119360 0.160868 0.178802 0.106553 0.104086 0.140951 0.142568 0.161053 0.159544 0.154540
qa: -0.0656 -0.2884 -0.5000 -0.4626 -0.2889 0.0905 0.0416 -0.0830 -0.2793 -0.2587 -0.1028 0.4395 -0.1678 -0.1340 0.2968 -0.1256 0.0838 -0.1245 -0.2625 -0.0349 0.1717 0.0076 0.0120 -0.2080 -0.2015 -0.1442 -0.1492 -0.1778 0.1137 0.1032 0.1048 0.0970 0.1000 0.0970 0.0967 0.0907 0.1182 0.1099 0.0951 0.1266 0.1159 0.1186 0.1194 0.1609 0.1788 0.1066 0.1041 0.1410 0.1426 0.1611 0.1595 0.1545
va: 2.4201 2.1307 1.9846 2.0150 2.2659 3.7596 3.7723 3.8928 3.9026 3.9067 3.7927 4.0527 3.6613 3.9882 4.1684 3.9424 3.8425 3.7623 3.9601 3.9649 3.7303 3.8324 3.6201 3.9867 3.9192 3.8354 3.9214 3.8420 1.0057 1.0285 0.9980 1.0133 1.0002 1.0018 1.0018 1.0051 1.0456 1.0010 1.0100 1.0109 1.0046 1.0085 0.9984 1.0134 0.9931 1.0029 1.0105 1.0050 1.0029 0.9885 0.9906 1.0036
dispcorr: -0.028232765 hartree
energy: -1590.125925601951
dipole: 15.53859 -13.77820 1.76039 -2.00297 2.81593 0.81295 -5.29980 2.18395 -3.11585
magnitude: 3.66993 au
magnitude: 9.32822 debye
