program: Orca
programVersion: 5.0.2
elementType: S O O O O C C C C C C C C C C C C C C C C C C C C C C C H H H H H H H H H H H H H H H H H H H H H H H H
charge: 0
multiplicity: 1
keywords: wb97x-d3
keywords: def2-TZVPP
keywords: def2/J RIJCOSX
keywords: DEFGRID2
keywords: scfconv7
keywords: smallprint printgap noloewdin
keywords: NOSOSCF
formula: C23H24O4S
InChI: InChI=1/C23H24O4S/c1-23(2)19(12-17-8-9-28-22(17)25)20(23)21(24)27-14-16-11-18(26-13-16)10-15-6-4-3-5-7-15/h3-7,11-13,19-20H,8-10,14H2,1-2H3
52 atoms
S  -0.496002 -2.383232 2.4922
O  1.695092 2.072869 -1.134069
O  2.754865 1.285604 0.670277
O  2.039377 -2.195073 3.155877
O  -1.412067 1.367476 1.917509
C  4.345982 -0.50046 -1.316101
C  3.117706 -1.257129 -0.956674
C  3.000078 0.189282 -1.446558
C  5.342031 -0.093753 -0.259091
C  5.000238 -0.846846 -2.632852
C  2.771477 -1.609199 0.434216
C  2.506406 1.215501 -0.512244
C  1.514505 -1.808601 0.839288
C  0.274572 -1.636946 0.023181
C  1.235676 -2.130396 2.25341
C  -0.858622 -2.397644 0.709702
C  0.97123 3.01544 -0.322339
C  -0.166162 2.350725 0.366627
C  -1.387636 1.896995 -0.233093
C  -0.239512 1.993649 1.668814
C  -2.107221 1.30897 0.751204
C  -3.442972 0.654749 0.801061
C  -4.07872 0.569332 -0.559692
C  -5.155932 1.382746 -0.894604
C  -3.594025 -0.325758 -1.511621
C  -5.743827 1.301532 -2.151252
C  -4.176546 -0.408026 -2.767565
C  -5.255686 0.405776 -3.091361
H  2.75068 -1.968035 -1.692899
H  2.631039 0.298324 -2.459089
H  5.864911 0.814946 -0.560902
H  4.909868 0.083913 0.721299
H  6.090612 -0.880273 -0.149105
H  5.694322 -1.679217 -2.504494
H  4.26886 -1.136569 -3.38793
H  5.565548 0.001765 -3.021329
H  3.578265 -1.723983 1.150729
H  0.398199 -1.991128 -1.000587
H  0.02336 -0.573285 -0.033464
H  -0.907259 -3.433043 0.376642
H  -1.829554 -1.937767 0.544771
H  1.636412 3.511042 0.385076
H  0.616375 3.763996 -1.028511
H  -1.679034 2.00491 -1.265973
H  0.431284 2.119868 2.504143
H  -3.338572 -0.348126 1.227439
H  -4.09754 1.20783 1.480839
H  -5.542804 2.0839 -0.164722
H  -2.753518 -0.965573 -1.268054
H  -6.584697 1.938585 -2.39319
H  -3.790512 -1.11143 -3.494068
H  -5.713314 0.339695 -4.069856
elementType: S O C H
totalener: -1590.09562372 hartree
nucrepener: 2813.67517630 hartree
electener: -4403.77080002 hartree
oneelecener: -7767.49490651 hartree
twoeener: 3363.72410649 hartree
cpcmener: -0.04768480 hartree
kineticenergy: 1584.20638083 hartree
xcener: -135.008918633417 hartree
chargesum: -0.0000000
charge: -0.060803 -0.292587 -0.487996 -0.456337 -0.284540 0.115372 -0.040223 -0.075093 -0.293457 -0.262344 -0.097333 0.392662 -0.107745 -0.075107 0.272504 -0.132892 0.091418 -0.095554 -0.269550 -0.023226 0.165523 -0.041058 0.028332 -0.187062 -0.216537 -0.158502 -0.165469 -0.168672 0.119600 0.095245 0.104016 0.093575 0.101017 0.095933 0.089398 0.097848 0.130590 0.107047 0.063157 0.134523 0.115335 0.120340 0.122072 0.156308 0.173928 0.117214 0.109561 0.141294 0.159976 0.159757 0.157729 0.160812
qa: -0.0608 -0.2926 -0.4880 -0.4563 -0.2845 0.1154 -0.0402 -0.0751 -0.2935 -0.2623 -0.0973 0.3927 -0.1077 -0.0751 0.2725 -0.1329 0.0914 -0.0956 -0.2695 -0.0232 0.1655 -0.0411 0.0283 -0.1871 -0.2165 -0.1585 -0.1655 -0.1687 0.1196 0.0952 0.1040 0.0936 0.1010 0.0959 0.0894 0.0978 0.1306 0.1070 0.0632 0.1345 0.1153 0.1203 0.1221 0.1563 0.1739 0.1172 0.1096 0.1413 0.1600 0.1598 0.1577 0.1608
va: 2.4396 2.1111 1.9961 2.0297 2.2499 3.7774 3.8762 3.8639 3.8948 3.8996 3.8086 4.0864 3.5703 3.9552 4.1797 3.9751 3.8267 3.6395 3.9167 3.9238 3.6334 3.8212 3.5736 3.9462 3.8962 3.8869 3.9357 3.8894 1.0065 1.0314 0.9993 1.0161 0.9988 1.0022 1.0044 1.0019 1.0143 1.0089 1.0350 1.0063 0.9961 1.0093 0.9922 1.0062 1.0017 0.9981 1.0126 1.0041 0.9882 0.9899 0.9927 0.9891
dispcorr: -0.030941478 hartree
energy: -1590.126565196483
dipole: 7.80246 -8.90423 -1.10176 0.28561 -0.01476 0.27085 -19.06766 15.35585 -3.71181
magnitude: 3.88134 au
magnitude: 9.86557 debye
