program: Orca
programVersion: 5.0.2
elementType: S O O O O C C C C C C C C C C C C C C C C C C C C C C C H H H H H H H H H H H H H H H H H H H H H H H H
charge: 0
multiplicity: 1
keywords: wb97x-d3
keywords: def2-TZVPP
keywords: def2/J RIJCOSX
keywords: DEFGRID2
keywords: scfconv7
keywords: smallprint printgap noloewdin
keywords: NOSOSCF
formula: C23H24O4S
InChI: InChI=1/C23H24O4S/c1-23(2)19(12-17-8-9-28-22(17)25)20(23)21(24)27-14-16-11-18(26-13-16)10-15-6-4-3-5-7-15/h3-7,11-13,19-20H,8-10,14H2,1-2H3
52 atoms
S  -0.433204 -2.546201 2.695402
O  1.708485 1.932846 -1.240185
O  2.598805 1.164019 0.662141
O  2.138139 -2.728258 3.205862
O  -1.586809 1.989559 1.776931
C  4.301526 -0.651887 -1.234728
C  3.096098 -1.431136 -0.842445
C  2.932104 -0.016948 -1.397841
C  5.27503 -0.161094 -0.192881
C  4.973259 -1.034839 -2.532127
C  2.773675 -1.758331 0.559853
C  2.423391 1.059173 -0.530682
C  1.538871 -2.057357 0.971683
C  0.286611 -2.030239 0.155695
C  1.301579 -2.465889 2.37119
C  -0.883459 -1.78161 1.106034
C  1.062118 3.005734 -0.535209
C  -0.157267 2.533956 0.170434
C  -1.365953 2.044047 -0.427488
C  -0.350723 2.468131 1.506941
C  -2.198817 1.727369 0.591713
C  -3.578597 1.175565 0.664058
C  -4.121702 0.84007 -0.6975
C  -3.71169 -0.317479 -1.356004
C  -5.034935 1.680511 -1.325061
C  -4.211266 -0.632105 -2.611358
C  -5.539381 1.367563 -2.581408
C  -5.130392 0.209319 -3.226793
H  2.757036 -2.18324 -1.55006
H  2.567784 0.030751 -2.416743
H  5.774203 0.7451 -0.539525
H  4.82858 0.057228 0.773293
H  6.044572 -0.918317 -0.033539
H  4.255864 -1.392083 -3.271575
H  5.502437 -0.183042 -2.962435
H  5.702035 -1.82948 -2.363274
H  3.587802 -1.797388 1.276569
H  0.152372 -2.989382 -0.351958
H  0.31269 -1.25617 -0.612619
H  -1.811172 -2.223373 0.749774
H  -1.042352 -0.717233 1.269897
H  1.755108 3.492513 0.152167
H  0.80659 3.722537 -1.314133
H  -1.575334 1.948537 -1.48189
H  0.26964 2.724273 2.35234
H  -3.575938 0.2804 1.294672
H  -4.237403 1.896383 1.157561
H  -2.998687 -0.980519 -0.879146
H  -5.361266 2.584029 -0.82378
H  -3.887192 -1.537662 -3.107784
H  -6.255922 2.027755 -3.052897
H  -5.525959 -0.038349 -4.203316
elementType: S O C H
totalener: -1590.09655219 hartree
nucrepener: 2774.44242034 hartree
electener: -4364.53897253 hartree
oneelecener: -7688.79840943 hartree
twoeener: 3324.25943690 hartree
cpcmener: -0.04680137 hartree
kineticenergy: 1584.19532073 hartree
xcener: -135.004549591980 hartree
chargesum: 0.0000000
charge: -0.059315 -0.291141 -0.491848 -0.456699 -0.291951 0.117231 -0.045650 -0.083862 -0.293237 -0.259431 -0.115294 0.407914 -0.092167 -0.124577 0.279326 -0.120404 0.098719 -0.083367 -0.301914 -0.021127 0.167918 -0.031790 -0.003443 -0.192678 -0.177318 -0.170922 -0.164059 -0.163733 0.122759 0.097440 0.104917 0.092028 0.102520 0.089306 0.097883 0.095753 0.132537 0.117202 0.093627 0.130160 0.099777 0.119741 0.123300 0.158099 0.176937 0.118005 0.109398 0.162481 0.141399 0.157849 0.160387 0.161317
qa: -0.0593 -0.2911 -0.4918 -0.4567 -0.2920 0.1172 -0.0457 -0.0839 -0.2932 -0.2594 -0.1153 0.4079 -0.0922 -0.1246 0.2793 -0.1204 0.0987 -0.0834 -0.3019 -0.0211 0.1679 -0.0318 -0.0034 -0.1927 -0.1773 -0.1709 -0.1641 -0.1637 0.1228 0.0974 0.1049 0.0920 0.1025 0.0893 0.0979 0.0958 0.1325 0.1172 0.0936 0.1302 0.0998 0.1197 0.1233 0.1581 0.1769 0.1180 0.1094 0.1625 0.1414 0.1578 0.1604 0.1613
va: 2.4458 2.1180 1.9942 2.0283 2.2472 3.7761 3.8592 3.8766 3.8992 3.8982 3.8370 4.0777 3.5581 3.9585 4.1862 3.9460 3.8282 3.6603 3.9385 3.9273 3.6219 3.8093 3.6032 3.8856 3.9374 3.9260 3.8945 3.8818 1.0038 1.0312 0.9991 1.0160 0.9987 1.0044 1.0018 1.0023 1.0150 1.0058 1.0092 1.0031 1.0177 1.0079 0.9905 1.0071 0.9965 0.9982 1.0110 0.9812 1.0037 0.9927 0.9898 0.9890
dispcorr: -0.029316466 hartree
energy: -1590.125868653710
dipole: 7.85733 -8.87582 -1.01848 1.31740 -0.47814 0.83926 -18.71497 15.07514 -3.63983
magnitude: 3.87170 au
magnitude: 9.84108 debye
