program: Orca
programVersion: 5.0.2
elementType: S O O O O C C C C C C C C C C C C C C C C C C C C C C C H H H H H H H H H H H H H H H H H H H H H H H H
charge: 0
multiplicity: 1
keywords: wb97x-d3
keywords: def2-TZVPP
keywords: def2/J RIJCOSX
keywords: DEFGRID2
keywords: scfconv7
keywords: smallprint printgap noloewdin
keywords: NOSOSCF
formula: C23H24O4S
InChI: InChI=1/C23H24O4S/c1-23(2)19(12-17-8-9-28-22(17)25)20(23)21(24)27-14-16-11-18(26-13-16)10-15-6-4-3-5-7-15/h3-7,11-13,19-20H,8-10,14H2,1-2H3
52 atoms
S  -0.491554 -2.425887 2.602869
O  1.705251 1.862928 -1.350498
O  2.617704 1.218269 0.583748
O  2.044223 -2.42203 3.294231
O  -1.490858 1.831638 1.753397
C  4.408322 -0.620707 -1.157043
C  3.205447 -1.415856 -0.786428
C  3.034085 -0.031687 -1.41542
C  5.320391 -0.055791 -0.096875
C  5.153651 -1.050308 -2.398329
C  2.809332 -1.665093 0.612682
C  2.45919 1.055902 -0.604684
C  1.57232 -2.02304 0.966645
C  0.383779 -2.171144 0.072354
C  1.25773 -2.297659 2.382843
C  -0.859899 -1.875148 0.906679
C  1.012906 2.93111 -0.679919
C  -0.162264 2.432394 0.081226
C  -1.399028 1.945339 -0.457142
C  -0.27819 2.329428 1.424224
C  -2.168766 1.593709 0.599441
C  -3.534332 1.018621 0.733908
C  -4.163253 0.773007 -0.609245
C  -3.863691 -0.37893 -1.332442
C  -5.036179 1.704811 -1.161739
C  -4.433544 -0.598866 -2.578594
C  -5.608066 1.488017 -2.40846
C  -5.309341 0.334014 -3.119574
H  2.923416 -2.211733 -1.470012
H  2.712232 -0.033188 -2.449716
H  5.832701 0.82999 -0.475607
H  4.819282 0.223949 0.824751
H  6.083436 -0.793602 0.154868
H  5.689567 -0.208748 -2.840219
H  5.887241 -1.819583 -2.151205
H  4.485077 -1.458198 -3.156941
H  3.566719 -1.578297 1.384843
H  0.334981 -3.192157 -0.315208
H  0.425603 -1.498748 -0.785253
H  -1.741949 -2.397889 0.544755
H  -1.071172 -0.808693 0.931014
H  1.696073 3.485802 -0.035718
H  0.699467 3.594056 -1.484466
H  -1.666716 1.875566 -1.499611
H  0.388137 2.57004 2.237696
H  -3.479988 0.082857 1.299703
H  -4.161885 1.69656 1.3197
H  -3.182934 -1.112312 -0.914933
H  -5.275325 2.605916 -0.609409
H  -4.197411 -1.5019 -3.12653
H  -6.290023 2.219716 -2.82196
H  -5.758457 0.160415 -4.088817
elementType: S O C H
totalener: -1590.09642711 hartree
nucrepener: 2782.19797431 hartree
electener: -4372.29440142 hartree
oneelecener: -7704.45948664 hartree
twoeener: 3332.16508522 hartree
cpcmener: -0.04616539 hartree
kineticenergy: 1584.22127297 hartree
xcener: -135.010388596101 hartree
chargesum: 0.0000000
charge: -0.062071 -0.293458 -0.492293 -0.455595 -0.292105 0.118488 -0.054962 -0.082110 -0.295597 -0.258416 -0.104664 0.411815 -0.106121 -0.125003 0.278809 -0.088033 0.097363 -0.085078 -0.306164 -0.021629 0.179012 -0.020393 0.003580 -0.196213 -0.188244 -0.169338 -0.160884 -0.165690 0.123278 0.097334 0.104063 0.093603 0.102534 0.097786 0.095800 0.089969 0.130600 0.115071 0.098301 0.133251 0.067510 0.120905 0.123378 0.158680 0.174102 0.115758 0.110601 0.162860 0.140309 0.157950 0.160190 0.161160
qa: -0.0621 -0.2935 -0.4923 -0.4556 -0.2921 0.1185 -0.0550 -0.0821 -0.2956 -0.2584 -0.1047 0.4118 -0.1061 -0.1250 0.2788 -0.0880 0.0974 -0.0851 -0.3062 -0.0216 0.1790 -0.0204 0.0036 -0.1962 -0.1882 -0.1693 -0.1609 -0.1657 0.1233 0.0973 0.1041 0.0936 0.1025 0.0978 0.0958 0.0900 0.1306 0.1151 0.0983 0.1333 0.0675 0.1209 0.1234 0.1587 0.1741 0.1158 0.1106 0.1629 0.1403 0.1579 0.1602 0.1612
va: 2.4409 2.1216 1.9931 2.0293 2.2523 3.7787 3.8571 3.8841 3.8965 3.8960 3.8384 4.0726 3.5730 3.9784 4.1879 3.9290 3.8240 3.6467 3.9460 3.9340 3.6128 3.8126 3.6022 3.8927 3.9423 3.9250 3.8916 3.8828 1.0043 1.0304 0.9991 1.0177 0.9987 1.0019 1.0021 1.0043 1.0175 1.0060 1.0057 1.0023 1.0329 1.0081 0.9914 1.0062 1.0006 0.9983 1.0108 0.9864 1.0043 0.9923 0.9897 0.9889
dispcorr: -0.029452547 hartree
energy: -1590.125879661601
dipole: 8.45969 -9.32011 -0.86042 0.56913 -0.05864 0.51049 -18.32284 14.59122 -3.73162
magnitude: 3.86341 au
magnitude: 9.82001 debye
