program: Orca
programVersion: 5.0.2
elementType: S O O O O C C C C C C C C C C C C C C C C C C C C C C C H H H H H H H H H H H H H H H H H H H H H H H H
charge: 0
multiplicity: 1
keywords: wb97x-d3
keywords: def2-TZVPP
keywords: def2/J RIJCOSX
keywords: DEFGRID2
keywords: scfconv7
keywords: smallprint printgap noloewdin
keywords: NOSOSCF
formula: C23H24O4S
InChI: InChI=1/C23H24O4S/c1-23(2)19(12-17-8-9-28-22(17)25)20(23)21(24)27-14-16-11-18(26-13-16)10-15-6-4-3-5-7-15/h3-7,11-13,19-20H,8-10,14H2,1-2H3
52 atoms
S  -1.504431 -2.130757 0.913777
O  2.45622 1.146837 0.568784
O  2.700798 2.287532 -1.334054
O  0.57455 -2.507428 2.4741
O  -1.559107 2.853858 -0.202066
C  4.606727 -0.734982 -0.585186
C  3.258023 -1.343889 -0.759785
C  3.512359 0.07968 -1.252281
C  5.126382 -0.383546 0.785982
C  5.693397 -1.210608 -1.520363
C  2.351854 -1.637183 0.366133
C  2.859584 1.275007 -0.685132
C  1.046298 -1.864811 0.20277
C  0.272592 -1.789879 -1.074096
C  0.199319 -2.208443 1.361019
C  -1.164062 -1.409676 -0.720963
C  1.775303 2.254641 1.187166
C  0.335898 2.307607 0.814017
C  -0.754636 1.643508 1.466222
C  -0.219777 3.018992 -0.195407
C  -1.883673 2.013936 0.816134
C  -3.325091 1.706501 1.019523
C  -3.891506 0.706368 0.037302
C  -4.35921 -0.524206 0.487984
C  -3.956934 0.985399 -1.327007
C  -4.869729 -1.462874 -0.400266
C  -4.461451 0.048196 -2.217376
C  -4.918084 -1.181108 -1.757605
H  3.153904 -2.039522 -1.588016
H  3.615262 0.171459 -2.326884
H  5.640407 -1.248005 1.209898
H  5.853338 0.427096 0.717276
H  4.361531 -0.080936 1.495887
H  5.299534 -1.46414 -2.505032
H  6.458861 -0.444207 -1.652071
H  6.17909 -2.100625 -1.116376
H  2.773032 -1.700218 1.364187
H  0.286945 -2.761681 -1.575089
H  0.692484 -1.060109 -1.767111
H  -1.886468 -1.79409 -1.437056
H  -1.282583 -0.330031 -0.649034
H  1.882918 2.075009 2.254895
H  2.283993 3.189353 0.951815
H  -0.696978 0.989678 2.32246
H  0.190163 3.678496 -0.943787
H  -3.440949 1.320872 2.03265
H  -3.900134 2.636104 0.973073
H  -4.323649 -0.752417 1.546063
H  -3.616547 1.941922 -1.703894
H  -5.227125 -2.414517 -0.028501
H  -4.503043 0.280777 -3.273689
H  -5.312966 -1.910414 -2.452888
elementType: S O C H
totalener: -1590.09294226 hartree
nucrepener: 2869.19695039 hartree
electener: -4459.28989265 hartree
oneelecener: -7878.53919151 hartree
twoeener: 3419.24929886 hartree
cpcmener: -0.04008362 hartree
kineticenergy: 1584.22624055 hartree
xcener: -135.015805997086 hartree
chargesum: -0.0000000
charge: -0.062802 -0.268074 -0.502892 -0.466764 -0.288766 0.121077 -0.051108 -0.130689 -0.287596 -0.263242 -0.073639 0.443303 -0.125684 -0.135605 0.292389 -0.111800 0.059180 -0.034030 -0.393028 -0.016243 0.260455 -0.067306 0.069056 -0.254118 -0.206047 -0.107414 -0.136916 -0.197586 0.122261 0.097465 0.102261 0.104357 0.092352 0.089947 0.097974 0.095730 0.129326 0.114699 0.097946 0.133861 0.107584 0.117205 0.127534 0.157824 0.169034 0.104411 0.118907 0.143215 0.136698 0.157980 0.159055 0.158262
qa: -0.0628 -0.2681 -0.5029 -0.4668 -0.2888 0.1211 -0.0511 -0.1307 -0.2876 -0.2632 -0.0736 0.4433 -0.1257 -0.1356 0.2924 -0.1118 0.0592 -0.0340 -0.3930 -0.0162 0.2605 -0.0673 0.0691 -0.2541 -0.2060 -0.1074 -0.1369 -0.1976 0.1223 0.0975 0.1023 0.1044 0.0924 0.0899 0.0980 0.0957 0.1293 0.1147 0.0979 0.1339 0.1076 0.1172 0.1275 0.1578 0.1690 0.1044 0.1189 0.1432 0.1367 0.1580 0.1591 0.1583
va: 2.4479 2.1165 1.9964 2.0179 2.2694 3.7836 3.8345 3.9103 3.9018 3.9008 3.8154 4.0868 3.5508 4.0537 4.1904 3.9254 3.8054 3.5801 3.9627 3.9586 3.4998 3.8165 3.5326 3.8821 3.9251 3.8114 3.8602 3.8930 1.0040 1.0281 0.9987 1.0001 1.0117 1.0045 1.0017 1.0019 1.0207 1.0042 1.0053 1.0113 1.0075 0.9988 1.0076 1.0115 1.0069 1.0111 1.0031 1.0093 1.0197 0.9908 0.9904 0.9914
dispcorr: -0.033115881 hartree
energy: -1590.126058137795
dipole: 13.69712 -13.23925 0.45787 -2.62092 2.58036 -0.04056 -7.52226 6.21958 -1.30268
magnitude: 1.38140 au
magnitude: 3.51124 debye
