program: Orca
programVersion: 5.0.2
elementType: S O O O O C C C C C C C C C C C C C C C C C C C C C C C H H H H H H H H H H H H H H H H H H H H H H H H
charge: 0
multiplicity: 1
keywords: wb97x-d3
keywords: def2-TZVPP
keywords: def2/J RIJCOSX
keywords: DEFGRID2
keywords: scfconv7
keywords: smallprint printgap noloewdin
keywords: NOSOSCF
formula: C23H24O4S
InChI: InChI=1/C23H24O4S/c1-23(2)19(12-17-8-9-28-22(17)25)20(23)21(24)27-14-16-11-18(26-13-16)10-15-6-4-3-5-7-15/h3-7,11-13,19-20H,8-10,14H2,1-2H3
52 atoms
S  -1.133089 -2.232186 -1.776416
O  2.245112 1.269291 0.954258
O  3.225252 2.451253 -0.666634
O  -0.583079 -2.095588 0.789424
O  -1.196409 2.065034 -1.616561
C  4.571538 -0.671884 0.851339
C  3.57704 -1.143251 -0.150247
C  4.067019 0.305302 -0.194952
C  4.212254 -0.548549 2.311474
C  6.002861 -1.11039 0.642472
C  2.180342 -1.475747 0.190346
C  3.15254 1.444147 0.006124
C  1.205779 -1.526141 -0.721154
C  1.302297 -1.167194 -2.167859
C  -0.15495 -1.945587 -0.33286
C  0.25911 -1.986653 -2.923315
C  1.22913 2.275976 1.124435
C  0.089562 2.057251 0.191817
C  -1.128156 1.356548 0.478738
C  -0.012181 2.46092 -1.0969
C  -1.876097 1.396031 -0.649054
C  -3.223341 0.879196 -1.015261
C  -4.024634 0.488422 0.196494
C  -3.920164 -0.786727 0.744573
C  -4.877391 1.408821 0.799796
C  -4.651594 -1.135667 1.872444
C  -5.614698 1.062204 1.923575
C  -5.501824 -0.211783 2.464852
H  3.967548 -1.727586 -0.979648
H  4.767933 0.512125 -0.994566
H  4.789781 0.250563 2.778457
H  3.161611 -0.354809 2.505471
H  4.469879 -1.478385 2.821409
H  6.252873 -1.196767 -0.415478
H  6.69669 -0.399075 1.09349
H  6.1741 -2.083406 1.106021
H  1.948806 -1.734874 1.218266
H  2.294398 -1.347663 -2.581223
H  1.089606 -0.099487 -2.285497
H  0.64687 -2.963001 -3.209109
H  -0.101034 -1.480679 -3.815905
H  0.900025 2.164064 2.155266
H  1.658901 3.270922 1.015682
H  -1.401998 0.902408 1.41797
H  0.635787 3.025475 -1.748384
H  -3.759647 1.646166 -1.580008
H  -3.115496 0.021018 -1.685616
H  -3.26937 -1.518839 0.282646
H  -4.970683 2.403795 0.380713
H  -4.561146 -2.132448 2.284438
H  -6.279808 1.787019 2.374974
H  -6.076828 -0.484523 3.340193
elementType: S O C H
totalener: -1590.09291553 hartree
nucrepener: 2847.95165818 hartree
electener: -4438.04457371 hartree
oneelecener: -7837.03525681 hartree
twoeener: 3398.99068310 hartree
cpcmener: -0.04163161 hartree
kineticenergy: 1584.21385200 hartree
xcener: -135.011255611018 hartree
chargesum: 0.0000000
charge: -0.069430 -0.268250 -0.503951 -0.459801 -0.284902 0.123685 -0.073523 -0.107981 -0.284770 -0.266291 -0.042812 0.428680 -0.117466 -0.125268 0.274267 -0.105834 0.062393 -0.084643 -0.281650 -0.020139 0.173970 -0.056649 0.041441 -0.194632 -0.193923 -0.174114 -0.157921 -0.166151 0.119008 0.094469 0.105132 0.090447 0.099301 0.089795 0.098705 0.095721 0.131431 0.103420 0.106848 0.122918 0.120577 0.115536 0.126928 0.161839 0.168581 0.111487 0.112864 0.139270 0.141109 0.159109 0.160130 0.161038
qa: -0.0694 -0.2682 -0.5040 -0.4598 -0.2849 0.1237 -0.0735 -0.1080 -0.2848 -0.2663 -0.0428 0.4287 -0.1175 -0.1253 0.2743 -0.1058 0.0624 -0.0846 -0.2816 -0.0201 0.1740 -0.0566 0.0414 -0.1946 -0.1939 -0.1741 -0.1579 -0.1662 0.1190 0.0945 0.1051 0.0904 0.0993 0.0898 0.0987 0.0957 0.1314 0.1034 0.1068 0.1229 0.1206 0.1155 0.1269 0.1618 0.1686 0.1115 0.1129 0.1393 0.1411 0.1591 0.1601 0.1610
va: 2.4316 2.1178 1.9899 2.0086 2.2523 3.7757 3.8583 3.8843 3.8985 3.9020 3.7546 4.1031 3.5931 3.9729 4.1498 3.9467 3.8081 3.6404 3.9009 3.9107 3.6232 3.8302 3.5454 3.8802 3.9522 3.9554 3.8841 3.8884 1.0056 1.0296 1.0000 1.0127 0.9995 1.0049 1.0014 1.0021 1.0188 1.0101 1.0109 1.0078 1.0070 0.9994 1.0108 1.0061 1.0077 1.0153 1.0101 1.0184 1.0036 0.9920 0.9894 0.9888
dispcorr: -0.031925033 hartree
energy: -1590.124840562571
dipole: 14.95900 -13.38123 1.57777 -2.80028 2.22842 -0.57186 5.49401 -6.32287 -0.82885
magnitude: 1.87173 au
magnitude: 4.75757 debye
