program: Orca
programVersion: 5.0.2
elementType: S O O O O C C C C C C C C C C C C C C C C C C C C C C C H H H H H H H H H H H H H H H H H H H H H H H H
charge: 0
multiplicity: 1
keywords: wb97x-d3
keywords: def2-TZVPP
keywords: def2/J RIJCOSX
keywords: DEFGRID2
keywords: scfconv7
keywords: smallprint printgap noloewdin
keywords: NOSOSCF
formula: C23H24O4S
InChI: InChI=1/C23H24O4S/c1-23(2)19(12-17-8-9-28-22(17)25)20(23)21(24)27-14-16-11-18(26-13-16)10-15-6-4-3-5-7-15/h3-7,11-13,19-20H,8-10,14H2,1-2H3
52 atoms
S  -1.150011 -2.386222 -1.558411
O  2.249051 1.304668 0.904933
O  3.203458 2.473972 -0.740067
O  -0.531706 -2.10477 0.979436
O  -1.18653 2.067005 -1.686593
C  4.607503 -0.602559 0.799287
C  3.579531 -1.117094 -0.145931
C  4.053839 0.332484 -0.261146
C  4.304429 -0.425197 2.266406
C  6.033691 -1.03641 0.550719
C  2.201225 -1.455884 0.259125
C  3.142807 1.473022 -0.05724
C  1.194453 -1.557008 -0.612336
C  1.228691 -1.252292 -2.074241
C  -0.140445 -1.997274 -0.161124
C  0.194445 -2.141051 -2.760678
C  1.222278 2.301645 1.067069
C  0.091894 2.067926 0.127208
C  -1.108237 1.332669 0.399291
C  -0.015045 2.485885 -1.156606
C  -1.852449 1.367603 -0.731223
C  -3.183309 0.816132 -1.107825
C  -4.022453 0.503638 0.101379
C  -3.942189 -0.735166 0.73009
C  -4.88482 1.464557 0.623083
C  -4.707024 -1.009809 1.856401
C  -5.654268 1.192506 1.745584
C  -5.566169 -0.046481 2.367026
H  3.945357 -1.727725 -0.967661
H  4.722601 0.517823 -1.09288
H  4.58625 -1.333684 2.801389
H  4.895761 0.393344 2.679377
H  3.261159 -0.227558 2.49364
H  6.241808 -1.162957 -0.512205
H  6.737772 -0.301822 0.944971
H  6.233314 -1.988565 1.045345
H  2.012212 -1.681747 1.303643
H  2.212511 -1.410559 -2.515447
H  0.969774 -0.198886 -2.224623
H  0.61017 -3.113977 -3.018184
H  -0.212707 -1.687082 -3.660971
H  0.888144 2.187407 2.096041
H  1.642085 3.301002 0.959359
H  -1.374997 0.859862 1.331328
H  0.62052 3.075964 -1.797485
H  -3.703395 1.539221 -1.740942
H  -3.048004 -0.085132 -1.713727
H  -3.283519 -1.498021 0.333863
H  -4.95857 2.432546 0.141499
H  -4.634997 -1.979635 2.331476
H  -6.325322 1.948112 2.133343
H  -6.166989 -0.260879 3.241201
elementType: S O C H
totalener: -1590.09268683 hartree
nucrepener: 2846.54314286 hartree
electener: -4436.63582968 hartree
oneelecener: -7834.09796334 hartree
twoeener: 3397.46213366 hartree
cpcmener: -0.04148204 hartree
kineticenergy: 1584.21531554 hartree
xcener: -135.011559780685 hartree
chargesum: 0.0000000
charge: -0.070174 -0.268410 -0.503053 -0.459633 -0.285173 0.122530 -0.076404 -0.105625 -0.285043 -0.266389 -0.041717 0.427754 -0.116573 -0.120357 0.269974 -0.107175 0.062197 -0.083848 -0.289539 -0.014714 0.183805 -0.064054 0.043587 -0.194933 -0.195407 -0.172316 -0.156396 -0.167530 0.119469 0.094725 0.099532 0.105361 0.091082 0.089959 0.098413 0.095592 0.131599 0.103093 0.105026 0.123640 0.120575 0.115743 0.127160 0.160892 0.167361 0.111874 0.113016 0.139305 0.141504 0.158777 0.159932 0.160988
qa: -0.0702 -0.2684 -0.5031 -0.4596 -0.2852 0.1225 -0.0764 -0.1056 -0.2850 -0.2664 -0.0417 0.4278 -0.1166 -0.1204 0.2700 -0.1072 0.0622 -0.0838 -0.2895 -0.0147 0.1838 -0.0641 0.0436 -0.1949 -0.1954 -0.1723 -0.1564 -0.1675 0.1195 0.0947 0.0995 0.1054 0.0911 0.0900 0.0984 0.0956 0.1316 0.1031 0.1050 0.1236 0.1206 0.1157 0.1272 0.1609 0.1674 0.1119 0.1130 0.1393 0.1415 0.1588 0.1599 0.1610
va: 2.4291 2.1164 1.9919 2.0110 2.2549 3.7748 3.8573 3.8825 3.8982 3.9028 3.7595 4.1056 3.5798 3.9763 4.1536 3.9448 3.8085 3.6413 3.9065 3.9087 3.6126 3.8338 3.5496 3.8753 3.9545 3.9554 3.8828 3.8887 1.0052 1.0294 0.9994 0.9999 1.0125 1.0047 1.0014 1.0023 1.0184 1.0100 1.0099 1.0078 1.0067 0.9990 1.0103 1.0080 1.0078 1.0159 1.0090 1.0155 1.0031 0.9919 0.9895 0.9889
dispcorr: -0.031909129 hartree
energy: -1590.124595955491
dipole: 14.96812 -13.44361 1.52451 -2.38527 1.78369 -0.60158 4.80475 -5.71534 -0.91059
magnitude: 1.87489 au
magnitude: 4.76559 debye
