program: Orca
programVersion: 5.0.2
elementType: S O O O O C C C C C C C C C C C C C C C C C C C C C C C H H H H H H H H H H H H H H H H H H H H H H H H
charge: 0
multiplicity: 1
keywords: wb97x-d3
keywords: def2-TZVPP
keywords: def2/J RIJCOSX
keywords: DEFGRID2
keywords: scfconv7
keywords: smallprint printgap noloewdin
keywords: NOSOSCF
formula: C23H24O4S
InChI: InChI=1/C23H24O4S/c1-23(2)19(12-17-8-9-28-22(17)25)20(23)21(24)27-14-16-11-18(26-13-16)10-15-6-4-3-5-7-15/h3-7,11-13,19-20H,8-10,14H2,1-2H3
52 atoms
S  -1.63327 -3.327697 1.166482
O  2.669189 1.814428 0.501058
O  2.341358 2.69424 -1.520477
O  -0.308656 -1.426598 2.382428
O  -1.45023 3.301944 0.368092
C  3.786751 -0.686024 -0.824008
C  2.305398 -0.888513 -1.036752
C  2.980299 0.437111 -1.413772
C  4.367516 -0.653571 0.568478
C  4.691042 -1.391298 -1.808204
C  1.380585 -1.029178 0.086129
C  2.634247 1.748507 -0.821925
C  0.425388 -1.96786 0.150012
C  0.126861 -3.036069 -0.857181
C  -0.413138 -2.068406 1.359362
C  -1.275426 -3.58735 -0.596189
C  2.117839 2.990371 1.130135
C  0.636875 2.950499 1.034596
C  -0.211638 1.954696 1.613771
C  -0.172518 3.736368 0.288209
C  -1.463215 2.201917 1.168238
C  -2.72793 1.441102 1.287416
C  -3.035105 0.56189 0.090585
C  -4.241539 -0.137074 0.064307
C  -2.156634 0.406685 -0.978223
C  -4.564351 -0.964667 -1.000436
C  -2.482194 -0.415174 -2.051666
C  -3.686266 -1.103019 -2.069072
H  2.051183 -1.481179 -1.908034
H  3.088107 0.543998 -2.486937
H  4.628544 -1.670567 0.8659
H  5.28547 -0.064001 0.581998
H  3.704652 -0.25535 1.329978
H  5.651815 -0.87878 -1.882586
H  4.882919 -2.415818 -1.485321
H  4.255266 -1.431276 -2.806895
H  1.488855 -0.360617 0.930842
H  0.860321 -3.840169 -0.761117
H  0.187058 -2.669152 -1.881995
H  -1.344947 -4.649225 -0.820059
H  -2.029691 -3.062184 -1.177765
H  2.455092 2.924199 2.162722
H  2.534996 3.897923 0.693984
H  0.085135 1.146047 2.261517
H  0.011476 4.606757 -0.322121
H  -2.657807 0.814294 2.178973
H  -3.5694 2.117804 1.460285
H  -4.935111 -0.033771 0.890909
H  -1.204693 0.923145 -0.991395
H  -5.504102 -1.501866 -0.997466
H  -1.78601 -0.517052 -2.874564
H  -3.937387 -1.745293 -2.90318
elementType: S O C H
totalener: -1590.09365303 hartree
nucrepener: 2893.78450286 hartree
electener: -4483.87815589 hartree
oneelecener: -7928.51210501 hartree
twoeener: 3444.63394912 hartree
cpcmener: -0.04280709 hartree
kineticenergy: 1584.20481505 hartree
xcener: -135.012051295481 hartree
chargesum: 0.0000000
charge: -0.056348 -0.271718 -0.494852 -0.465728 -0.288641 0.126530 0.041326 -0.124273 -0.266308 -0.265286 -0.127956 0.423858 -0.159880 -0.150950 0.295777 -0.134235 0.071184 -0.059427 -0.401036 -0.023283 0.251262 -0.026789 0.018966 -0.195038 -0.140867 -0.167557 -0.227016 -0.143999 0.113420 0.102670 0.097348 0.106080 0.093088 0.098002 0.096206 0.090903 0.131146 0.121320 0.099316 0.129583 0.119967 0.118900 0.123564 0.172047 0.176539 0.106034 0.113386 0.141519 0.133261 0.158637 0.155633 0.163716
qa: -0.0563 -0.2717 -0.4949 -0.4657 -0.2886 0.1265 0.0413 -0.1243 -0.2663 -0.2653 -0.1280 0.4239 -0.1599 -0.1509 0.2958 -0.1342 0.0712 -0.0594 -0.4010 -0.0233 0.2513 -0.0268 0.0190 -0.1950 -0.1409 -0.1676 -0.2270 -0.1440 0.1134 0.1027 0.0973 0.1061 0.0931 0.0980 0.0962 0.0909 0.1311 0.1213 0.0993 0.1296 0.1200 0.1189 0.1236 0.1720 0.1765 0.1060 0.1134 0.1415 0.1333 0.1586 0.1556 0.1637
va: 2.4402 2.1243 1.9956 2.0154 2.2625 3.7427 3.7640 3.8995 3.8977 3.9069 3.8029 4.1200 3.5809 3.9869 4.1461 3.9276 3.8444 3.6582 3.9539 3.9612 3.5541 3.8633 3.6372 3.9358 3.7711 3.8729 3.8699 3.8140 1.0034 1.0258 1.0007 1.0002 1.0087 1.0013 1.0021 1.0055 1.0103 0.9987 1.0078 1.0114 1.0141 0.9965 1.0059 1.0249 0.9977 1.0088 1.0090 0.9997 1.0018 0.9896 0.9937 0.9878
dispcorr: -0.033701967 hartree
energy: -1590.127354998213
dipole: 13.29177 -12.18451 1.10726 -8.35088 6.62441 -1.72647 -9.31457 7.91120 -1.40338
magnitude: 2.48519 au
magnitude: 6.31686 debye
