program: Orca
programVersion: 5.0.2
elementType: S O O O O C C C C C C C C C C C C C C C C C C C C C C C H H H H H H H H H H H H H H H H H H H H H H H H
charge: 0
multiplicity: 1
keywords: wb97x-d3
keywords: def2-TZVPP
keywords: def2/J RIJCOSX
keywords: DEFGRID2
keywords: scfconv7
keywords: smallprint printgap noloewdin
keywords: NOSOSCF
formula: C23H24O4S
InChI: InChI=1/C23H24O4S/c1-23(2)19(12-17-8-9-28-22(17)25)20(23)21(24)27-14-16-11-18(26-13-16)10-15-6-4-3-5-7-15/h3-7,11-13,19-20H,8-10,14H2,1-2H3
52 atoms
S  -1.781691 -3.322905 0.616383
O  2.727248 1.834288 0.426911
O  2.319407 2.494477 -1.66402
O  -0.653428 -1.373643 1.948055
O  -1.45309 3.251543 0.284961
C  3.908912 -0.739459 -0.590284
C  2.483769 -0.991805 -1.028127
C  3.188647 0.332618 -1.353284
C  4.257255 -0.640198 0.875924
C  4.97541 -1.459999 -1.38366
C  1.385429 -1.081586 -0.065968
C  2.698617 1.649182 -0.883734
C  0.428075 -2.01899 -0.108816
C  0.291117 -3.139266 -1.09363
C  -0.600214 -2.059859 0.949926
C  -1.145331 -3.66212 -1.049832
C  2.140107 3.04116 0.955129
C  0.65922 2.959043 0.899271
C  -0.163817 2.018568 1.597513
C  -0.180384 3.675136 0.117316
C  -1.433476 2.228944 1.182662
C  -2.702001 1.503383 1.423085
C  -3.138758 0.637554 0.257971
C  -2.269376 0.277081 -0.767704
C  -4.444955 0.151259 0.223251
C  -2.696449 -0.54379 -1.803696
C  -4.870446 -0.677291 -0.805089
C  -3.995947 -1.027456 -1.826385
H  2.381093 -1.633449 -1.896029
H  3.459113 0.3979 -2.401262
H  3.457748 -0.270641 1.510682
H  4.527177 -1.632897 1.239949
H  5.12491 0.00564 1.018457
H  5.928435 -0.932825 -1.308346
H  5.123003 -2.471483 -1.001782
H  4.718475 -1.534735 -2.441047
H  1.350784 -0.3628 0.744453
H  0.980184 -3.94412 -0.826049
H  0.537199 -2.831932 -2.110193
H  -1.196543 -4.731823 -1.237415
H  -1.784106 -3.154917 -1.770278
H  2.497684 3.081806 1.982471
H  2.519824 3.917708 0.429563
H  0.161434 1.270938 2.303194
H  -0.0231 4.488446 -0.573781
H  -2.565626 0.87573 2.30694
H  -3.50523 2.201996 1.67345
H  -1.244869 0.629595 -0.769782
H  -5.136411 0.424258 1.012215
H  -2.004083 -0.808849 -2.592943
H  -5.888009 -1.047159 -0.810237
H  -4.32515 -1.67108 -2.632042
elementType: S O C H
totalener: -1590.09453247 hartree
nucrepener: 2888.48147979 hartree
electener: -4478.57601227 hartree
oneelecener: -7918.32661582 hartree
twoeener: 3439.75060355 hartree
cpcmener: -0.04515809 hartree
kineticenergy: 1584.19461838 hartree
xcener: -135.010989294833 hartree
chargesum: 0.0000000
charge: -0.057013 -0.268078 -0.494252 -0.471638 -0.289973 0.133878 0.022200 -0.132183 -0.265755 -0.266347 -0.117188 0.431604 -0.176363 -0.157205 0.328146 -0.125588 0.069148 -0.055658 -0.388122 -0.022909 0.259256 -0.052629 0.029930 -0.152560 -0.195795 -0.218192 -0.164110 -0.162641 0.111491 0.105337 0.091478 0.096561 0.105385 0.097128 0.096546 0.091096 0.129037 0.115976 0.097836 0.133732 0.117986 0.118138 0.124967 0.161948 0.177245 0.106490 0.114371 0.139177 0.141447 0.165757 0.159265 0.161641
qa: -0.0570 -0.2681 -0.4943 -0.4716 -0.2900 0.1339 0.0222 -0.1322 -0.2658 -0.2663 -0.1172 0.4316 -0.1764 -0.1572 0.3281 -0.1256 0.0691 -0.0557 -0.3881 -0.0229 0.2593 -0.0526 0.0299 -0.1526 -0.1958 -0.2182 -0.1641 -0.1626 0.1115 0.1053 0.0915 0.0966 0.1054 0.0971 0.0965 0.0911 0.1290 0.1160 0.0978 0.1337 0.1180 0.1181 0.1250 0.1619 0.1772 0.1065 0.1144 0.1392 0.1414 0.1658 0.1593 0.1616
va: 2.4485 2.1334 1.9966 2.0130 2.2653 3.7171 3.7997 3.8918 3.9010 3.9049 3.8084 4.1178 3.5990 4.0008 4.1507 3.9517 3.8444 3.6380 3.9579 3.9634 3.5288 3.8620 3.6221 3.7862 3.9483 3.8902 3.8874 3.8573 1.0051 1.0246 1.0065 1.0015 1.0014 1.0014 1.0021 1.0050 1.0055 0.9990 1.0099 1.0070 1.0042 0.9961 1.0047 1.0239 0.9974 1.0109 1.0094 0.9988 1.0003 0.9856 0.9891 0.9884
dispcorr: -0.033625041 hartree
energy: -1590.128157514885
dipole: 14.80035 -13.20638 1.59396 -8.27079 6.56632 -1.70447 -6.28974 5.20730 -1.08244
magnitude: 2.57247 au
magnitude: 6.53870 debye
