program: Orca
programVersion: 5.0.2
elementType: S O O O O C C C C C C C C C C C C C C C C C C C C C C C H H H H H H H H H H H H H H H H H H H H H H H H
charge: 0
multiplicity: 1
keywords: wb97x-d3
keywords: def2-TZVPP
keywords: def2/J RIJCOSX
keywords: DEFGRID2
keywords: scfconv7
keywords: smallprint printgap noloewdin
keywords: NOSOSCF
formula: C23H24O4S
InChI: InChI=1/C23H24O4S/c1-23(2)19(12-17-8-9-28-22(17)25)20(23)21(24)27-14-16-11-18(26-13-16)10-15-6-4-3-5-7-15/h3-7,11-13,19-20H,8-10,14H2,1-2H3
52 atoms
S  -0.598242 -0.73717 -3.20497
O  1.994795 1.184211 0.491548
O  3.87962 2.320709 0.860208
O  -0.771741 -2.130374 -0.985227
O  -1.868551 2.066337 -1.331987
C  3.953408 -1.166058 1.323367
C  3.405201 -1.298213 -0.059248
C  4.03376 0.016622 0.375722
C  3.017142 -1.115346 2.505041
C  5.261612 -1.854649 1.624249
C  1.965002 -1.480527 -0.3300
C  3.30614 1.282978 0.605718
C  1.395172 -1.224007 -1.509766
C  2.045245 -0.621266 -2.712846
C  -0.04243 -1.486936 -1.707352
C  0.970649 0.142626 -3.487593
C  1.184979 2.363379 0.646165
C  -0.141304 2.054019 0.058751
C  -1.130118 1.132951 0.537368
C  -0.645779 2.581806 -1.07931
C  -2.154523 1.176437 -0.347342
C  -3.441968 0.438599 -0.466028
C  -3.928362 -0.064549 0.865552
C  -4.697861 0.757344 1.685266
C  -3.609703 -1.344346 1.307705
C  -5.145914 0.307518 2.918705
C  -4.054623 -1.796944 2.543634
C  -4.824807 -0.972785 3.351938
H  4.038622 -1.825958 -0.767861
H  5.023811 0.205415 -0.023686
H  3.480268 -0.569041 3.328232
H  2.060304 -0.641498 2.294619
H  2.808677 -2.126392 2.858933
H  5.793533 -1.348837 2.43176
H  5.086409 -2.885786 1.936137
H  5.917445 -1.876792 0.753401
H  1.347328 -1.879112 0.468956
H  2.464449 -1.408039 -3.345434
H  2.861462 0.049671 -2.44342
H  1.172506 0.173843 -4.555583
H  0.863815 1.163158 -3.123135
H  1.113039 2.607708 1.707713
H  1.639715 3.20944 0.1294
H  -1.073511 0.522819 1.425244
H  -0.270267 3.318778 -1.772239
H  -4.192097 1.097857 -0.909484
H  -3.319876 -0.398924 -1.160315
H  -4.9538 1.755882 1.350583
H  -3.014474 -1.995099 0.678728
H  -5.749894 0.955637 3.540618
H  -3.802582 -2.796928 2.872255
H  -5.176479 -1.326152 4.312447
elementType: S O C H
totalener: -1590.09385734 hartree
nucrepener: 2837.55030655 hartree
electener: -4427.64416389 hartree
oneelecener: -7815.89749514 hartree
twoeener: 3388.25333125 hartree
cpcmener: -0.04395138 hartree
kineticenergy: 1584.21726842 hartree
xcener: -135.009748736262 hartree
chargesum: -0.0000000
charge: -0.063496 -0.252969 -0.502149 -0.468735 -0.279615 0.110871 -0.039766 -0.146922 -0.285171 -0.264598 -0.069391 0.451464 -0.112586 -0.142352 0.292590 -0.118522 0.063463 -0.097262 -0.289555 -0.039218 0.159477 -0.007797 0.028075 -0.201509 -0.201546 -0.154217 -0.162824 -0.169891 0.123124 0.103251 0.105697 0.088395 0.104677 0.096908 0.095173 0.089742 0.134420 0.115081 0.098876 0.131446 0.120163 0.125374 0.110290 0.163780 0.180686 0.112572 0.096640 0.142263 0.146369 0.159056 0.159606 0.160561
qa: -0.0635 -0.2530 -0.5021 -0.4687 -0.2796 0.1109 -0.0398 -0.1469 -0.2852 -0.2646 -0.0694 0.4515 -0.1126 -0.1424 0.2926 -0.1185 0.0635 -0.0973 -0.2896 -0.0392 0.1595 -0.0078 0.0281 -0.2015 -0.2015 -0.1542 -0.1628 -0.1699 0.1231 0.1033 0.1057 0.0884 0.1047 0.0969 0.0952 0.0897 0.1344 0.1151 0.0989 0.1314 0.1202 0.1254 0.1103 0.1638 0.1807 0.1126 0.0966 0.1423 0.1464 0.1591 0.1596 0.1606
va: 2.4354 2.1167 1.9967 2.0037 2.2535 3.8027 3.8278 3.9156 3.9102 3.9025 3.7950 4.0829 3.5255 4.0067 4.1510 3.9301 3.8531 3.7458 3.8806 3.9079 3.6439 3.7973 3.5851 3.9537 3.8935 3.8844 3.9212 3.8921 1.0039 1.0262 1.0012 1.0085 0.9991 1.0019 1.0017 1.0046 1.0139 1.0049 1.0062 1.0106 1.0058 0.9904 1.0093 1.0037 0.9924 1.0153 1.0139 1.0032 1.0179 0.9899 0.9913 0.9892
dispcorr: -0.031616628 hartree
energy: -1590.125473970902
dipole: 12.88938 -11.37043 1.51895 -5.53256 5.63172 0.09916 11.45161 -12.04594 -0.59433
magnitude: 1.63410 au
magnitude: 4.15354 debye
