program: Orca
programVersion: 5.0.2
elementType: S O O O O C C C C C C C C C C C C C C C C C C C C C C C H H H H H H H H H H H H H H H H H H H H H H H H
charge: 0
multiplicity: 1
keywords: wb97x-d3
keywords: def2-TZVPP
keywords: def2/J RIJCOSX
keywords: DEFGRID2
keywords: scfconv7
keywords: smallprint printgap noloewdin
keywords: NOSOSCF
formula: C23H24O4S
InChI: InChI=1/C23H24O4S/c1-23(2)19(12-17-8-9-28-22(17)25)20(23)21(24)27-14-16-11-18(26-13-16)10-15-6-4-3-5-7-15/h3-7,11-13,19-20H,8-10,14H2,1-2H3
52 atoms
S  -0.729397 -3.08545 -0.311201
O  2.343066 1.451865 0.606417
O  2.698575 2.040598 -1.516322
O  0.406257 -2.612086 2.010684
O  -1.749501 1.409167 -1.190275
C  4.934598 -0.089658 0.586543
C  3.932016 -1.021923 -0.001833
C  4.087936 0.390449 -0.575025
C  4.776132 0.444241 1.989489
C  6.381243 -0.3431 0.22867
C  2.70318 -1.442514 0.696562
C  2.987272 1.371779 -0.546515
C  1.67814 -2.011114 0.055678
C  1.560338 -2.22801 -1.41898
C  0.518199 -2.529666 0.807971
C  0.074084 -2.328229 -1.756361
C  1.231912 2.359804 0.706904
C  -0.007018 1.776358 0.133603
C  -0.800256 0.719771 0.688543
C  -0.631022 2.146243 -1.008056
C  -1.846958 0.539954 -0.14965
C  -3.042506 -0.339199 -0.10984
C  -4.312342 0.455271 0.076966
C  -4.668837 0.920227 1.340601
C  -5.129932 0.760459 -1.005769
C  -5.822131 1.669976 1.519301
C  -6.285212 1.512145 -0.830584
C  -6.634283 1.969446 0.432156
H  4.317957 -1.776151 -0.682329
H  4.600906 0.420216 -1.528802
H  5.214619 1.439774 2.070994
H  3.750891 0.505339 2.341352
H  5.316108 -0.207498 2.678436
H  6.966053 0.574804 0.307828
H  6.818157 -1.076741 0.908195
H  6.490226 -0.723299 -0.787523
H  2.650854 -1.328498 1.774248
H  2.066313 -3.154883 -1.702516
H  2.019738 -1.41954 -1.988704
H  -0.111991 -2.945431 -2.632064
H  -0.367016 -1.345783 -1.922073
H  1.118873 2.52663 1.776592
H  1.47375 3.315528 0.241514
H  -0.617807 0.179907 1.604585
H  -0.412088 2.893645 -1.754569
H  -3.10595 -0.933418 -1.025417
H  -2.911541 -1.042037 0.713093
H  -4.038434 0.6908 2.192061
H  -4.866861 0.401158 -1.99353
H  -6.088804 2.01993 2.508274
H  -6.91346 1.738523 -1.682403
H  -7.534856 2.553475 0.570369
elementType: S O C H
totalener: -1590.09397312 hartree
nucrepener: 2795.48154921 hartree
electener: -4385.57552233 hartree
oneelecener: -7731.35817047 hartree
twoeener: 3345.78264814 hartree
cpcmener: -0.04300688 hartree
kineticenergy: 1584.23071705 hartree
xcener: -135.012490923686 hartree
chargesum: 0.0000000
charge: -0.065880 -0.266291 -0.503104 -0.461410 -0.292363 0.140144 -0.071654 -0.120851 -0.282005 -0.263883 -0.082806 0.437117 -0.103862 -0.135624 0.290942 -0.125329 0.067001 -0.048356 -0.357720 -0.022833 0.224144 -0.050189 0.038060 -0.198843 -0.199655 -0.168024 -0.165984 -0.167211 0.121028 0.096193 0.106038 0.087493 0.099087 0.098534 0.095691 0.089822 0.131387 0.114806 0.096376 0.133212 0.116309 0.117134 0.125212 0.159936 0.176575 0.112297 0.111360 0.146105 0.141957 0.159278 0.159464 0.161174
qa: -0.0659 -0.2663 -0.5031 -0.4614 -0.2924 0.1401 -0.0717 -0.1209 -0.2820 -0.2639 -0.0828 0.4371 -0.1039 -0.1356 0.2909 -0.1253 0.0670 -0.0484 -0.3577 -0.0228 0.2241 -0.0502 0.0381 -0.1988 -0.1997 -0.1680 -0.1660 -0.1672 0.1210 0.0962 0.1060 0.0875 0.0991 0.0985 0.0957 0.0898 0.1314 0.1148 0.0964 0.1332 0.1163 0.1171 0.1252 0.1599 0.1766 0.1123 0.1114 0.1461 0.1420 0.1593 0.1595 0.1612
va: 2.4222 2.1188 1.9926 2.0178 2.2512 3.7662 3.8600 3.8879 3.8989 3.8998 3.7738 4.1074 3.5265 3.9997 4.1472 3.9487 3.8317 3.6052 3.9575 3.9559 3.5082 3.7763 3.6156 3.9306 3.9510 3.9048 3.8996 3.8844 1.0040 1.0293 1.0000 1.0129 0.9998 1.0011 1.0023 1.0049 1.0219 1.0048 1.0095 1.0092 1.0021 0.9956 1.0077 1.0174 0.9981 1.0029 1.0147 1.0029 1.0054 0.9909 0.9907 0.9893
dispcorr: -0.030577928 hartree
energy: -1590.124551044082
dipole: 14.93723 -13.46308 1.47415 3.36578 -3.38142 -0.01564 1.13663 -1.95695 -0.82032
magnitude: 1.68710 au
magnitude: 4.28826 debye
