program: Orca
programVersion: 5.0.2
elementType: S O O O O C C C C C C C C C C C C C C C C C C C C C C C H H H H H H H H H H H H H H H H H H H H H H H H
charge: 0
multiplicity: 1
keywords: wb97x-d3
keywords: def2-TZVPP
keywords: def2/J RIJCOSX
keywords: DEFGRID2
keywords: scfconv7
keywords: smallprint printgap noloewdin
keywords: NOSOSCF
formula: C23H24O4S
InChI: InChI=1/C23H24O4S/c1-23(2)19(12-17-8-9-28-22(17)25)20(23)21(24)27-14-16-11-18(26-13-16)10-15-6-4-3-5-7-15/h3-7,11-13,19-20H,8-10,14H2,1-2H3
52 atoms
S  -1.33913 -2.405938 1.988443
O  2.462336 1.359065 0.449147
O  2.132405 2.454357 -1.468924
O  1.079258 -2.065729 2.953164
O  -1.677634 1.453624 1.620432
C  4.033567 -0.677885 -1.225494
C  2.644274 -1.184434 -1.000023
C  2.866612 0.219402 -1.574999
C  4.952958 -0.365726 -0.071702
C  4.771874 -1.242219 -2.416728
C  2.085661 -1.402405 0.34238
C  2.461664 1.452109 -0.870961
C  0.84159 -1.838868 0.566211
C  -0.218127 -2.141689 -0.445789
C  0.395344 -2.075282 1.953114
C  -1.577963 -1.987497 0.23361
C  1.831359 2.395943 1.226333
C  0.353643 2.236085 1.184529
C  -0.572042 2.784698 0.238417
C  -0.380629 1.437194 1.995155
C  -1.787273 2.27515 0.544139
C  -3.111919 2.376816 -0.117028
C  -3.443852 1.127334 -0.902494
C  -2.633738 0.735709 -1.967287
C  -4.542288 0.34166 -0.572837
C  -2.918987 -0.413228 -2.689179
C  -4.830753 -0.811611 -1.294438
C  -4.020498 -1.192353 -2.353761
H  2.262612 -1.867982 -1.751903
H  2.663082 0.300099 -2.636303
H  4.456977 0.010012 0.818176
H  5.498014 -1.267081 0.212746
H  5.688847 0.38005 -0.376137
H  4.098441 -1.471212 -3.243048
H  5.519334 -0.535092 -2.78032
H  5.289381 -2.162779 -2.141687
H  2.726552 -1.234596 1.200262
H  -0.102048 -3.167134 -0.806406
H  -0.162537 -1.484311 -1.313877
H  -2.329335 -2.649792 -0.188622
H  -1.941631 -0.964351 0.172716
H  2.212012 2.247013 2.234452
H  2.148383 3.381332 0.886056
H  -0.357325 3.467237 -0.567927
H  -0.122905 0.835731 2.853453
H  -3.896556 2.574801 0.616725
H  -3.080647 3.238013 -0.787046
H  -1.768488 1.333359 -2.231141
H  -5.179313 0.631987 0.254225
H  -2.279717 -0.702677 -3.513457
H  -5.68956 -1.413145 -1.025514
H  -4.242667 -2.090604 -2.915203
elementType: S O C H
totalener: -1590.09484254 hartree
nucrepener: 2892.30027094 hartree
electener: -4482.39511349 hartree
oneelecener: -7924.71556672 hartree
twoeener: 3442.32045323 hartree
cpcmener: -0.04124259 hartree
kineticenergy: 1584.22132026 hartree
xcener: -135.013188939784 hartree
chargesum: 0.0000000
charge: -0.061784 -0.271257 -0.498697 -0.464541 -0.278289 0.121378 -0.044939 -0.093948 -0.284048 -0.261128 -0.081071 0.430766 -0.126257 -0.133957 0.282138 -0.089112 0.055218 -0.065625 -0.290545 -0.047894 0.192794 -0.056022 0.015208 -0.164734 -0.159930 -0.190001 -0.172902 -0.150935 0.121279 0.098226 0.095937 0.102309 0.103449 0.090822 0.097902 0.096416 0.121003 0.113957 0.096387 0.141109 0.048529 0.119087 0.126365 0.162061 0.174339 0.106387 0.116188 0.140948 0.141652 0.158631 0.158230 0.158899
qa: -0.0618 -0.2713 -0.4987 -0.4645 -0.2783 0.1214 -0.0449 -0.0939 -0.2840 -0.2611 -0.0811 0.4308 -0.1263 -0.1340 0.2821 -0.0891 0.0552 -0.0656 -0.2905 -0.0479 0.1928 -0.0560 0.0152 -0.1647 -0.1599 -0.1900 -0.1729 -0.1509 0.1213 0.0982 0.0959 0.1023 0.1034 0.0908 0.0979 0.0964 0.1210 0.1140 0.0964 0.1411 0.0485 0.1191 0.1264 0.1621 0.1743 0.1064 0.1162 0.1409 0.1417 0.1586 0.1582 0.1589
va: 2.4465 2.1223 1.9991 2.0164 2.2562 3.8045 3.7930 3.8967 3.8943 3.8958 3.8093 4.1066 3.5567 3.9618 4.1755 3.9177 3.8425 3.6447 4.0043 3.9371 3.6389 3.8337 3.6029 3.8217 3.8892 3.8755 3.8871 3.8247 1.0038 1.0268 1.0130 0.9994 0.9996 1.0048 1.0018 1.0021 1.0315 1.0032 1.0068 1.0025 1.0397 1.0010 1.0040 1.0157 0.9995 1.0123 1.0059 1.0074 1.0022 0.9917 0.9910 0.9902
dispcorr: -0.033338466 hartree
energy: -1590.128181009080
dipole: 10.86686 -10.91540 -0.04854 -2.10871 1.79391 -0.31480 -15.56761 13.48150 -2.08611
magnitude: 2.11029 au
magnitude: 5.36392 debye
