program: Orca
programVersion: 5.0.2
elementType: S O O O O C C C C C C C C C C C C C C C C C C C C C C C H H H H H H H H H H H H H H H H H H H H H H H H
charge: 0
multiplicity: 1
keywords: wb97x-d3
keywords: def2-TZVPP
keywords: def2/J RIJCOSX
keywords: DEFGRID2
keywords: scfconv7
keywords: smallprint printgap noloewdin
keywords: NOSOSCF
formula: C23H24O4S
InChI: InChI=1/C23H24O4S/c1-23(2)19(12-17-8-9-28-22(17)25)20(23)21(24)27-14-16-11-18(26-13-16)10-15-6-4-3-5-7-15/h3-7,11-13,19-20H,8-10,14H2,1-2H3
52 atoms
S  -1.322794 -2.369812 1.975678
O  2.446281 1.335152 0.434117
O  2.111257 2.388881 -1.506526
O  1.08736 -2.086307 2.978307
O  -1.696242 1.470144 1.645626
C  4.090778 -0.687233 -1.185772
C  2.715741 -1.226043 -0.959831
C  2.900744 0.170825 -1.56307
C  4.992111 -0.327138 -0.031829
C  4.852428 -1.252756 -2.361808
C  2.147053 -1.431792 0.381647
C  2.457531 1.405306 -0.886853
C  0.887986 -1.829508 0.591259
C  -0.165061 -2.085536 -0.440335
C  0.417542 -2.071118 1.968943
C  -1.532409 -1.92765 0.223778
C  1.813017 2.386743 1.188856
C  0.335061 2.224406 1.161811
C  -0.60094 2.763486 0.220132
C  -0.392817 1.447394 1.998807
C  -1.815991 2.272845 0.555978
C  -3.152209 2.375402 -0.082291
C  -3.485881 1.133724 -0.878881
C  -2.718529 0.791236 -1.991115
C  -4.538235 0.303796 -0.510059
C  -3.000897 -0.353409 -2.721104
C  -4.823917 -0.845109 -1.239766
C  -4.05647 -1.177144 -2.346568
H  2.358077 -1.935593 -1.699695
H  2.705197 0.223642 -2.627548
H  5.711164 0.431252 -0.344759
H  4.478808 0.052511 0.846482
H  5.558338 -1.207836 0.274807
H  4.190341 -1.519146 -3.186066
H  5.579811 -0.530743 -2.736685
H  5.396302 -2.151398 -2.065966
H  2.790258 -1.288208 1.242663
H  -0.060422 -3.101121 -0.830801
H  -0.086674 -1.403298 -1.287371
H  -2.28347 -2.577815 -0.217448
H  -1.887065 -0.901029 0.170161
H  2.1998 2.264778 2.197961
H  2.123533 3.365092 0.82311
H  -0.39284 3.429038 -0.602151
H  -0.12902 0.860741 2.865461
H  -3.924516 2.555191 0.668825
H  -3.140116 3.246229 -0.73976
H  -1.889938 1.424702 -2.287065
H  -5.141844 0.555897 0.353896
H  -2.396673 -0.603249 -3.583926
H  -5.646782 -1.481365 -0.939991
H  -4.276854 -2.07133 -2.915225
elementType: S O C H
totalener: -1590.09492971 hartree
nucrepener: 2889.54337176 hartree
electener: -4479.63830147 hartree
oneelecener: -7919.21399664 hartree
twoeener: 3439.57569517 hartree
cpcmener: -0.04138396 hartree
kineticenergy: 1584.21936172 hartree
xcener: -135.012428839179 hartree
chargesum: 0.0000000
charge: -0.061508 -0.269919 -0.500604 -0.464374 -0.278113 0.124178 -0.054134 -0.100056 -0.284506 -0.261788 -0.072037 0.433678 -0.132333 -0.130041 0.284339 -0.089105 0.053633 -0.062692 -0.290789 -0.051457 0.193879 -0.056535 0.018450 -0.164907 -0.160136 -0.189508 -0.177040 -0.149085 0.121603 0.098051 0.103571 0.094851 0.102434 0.090716 0.098180 0.096221 0.124316 0.114875 0.096407 0.142079 0.045972 0.119002 0.126327 0.161600 0.175765 0.106207 0.116538 0.140929 0.141005 0.158513 0.158240 0.159107
qa: -0.0615 -0.2699 -0.5006 -0.4644 -0.2781 0.1242 -0.0541 -0.1001 -0.2845 -0.2618 -0.0720 0.4337 -0.1323 -0.1300 0.2843 -0.0891 0.0536 -0.0627 -0.2908 -0.0515 0.1939 -0.0565 0.0184 -0.1649 -0.1601 -0.1895 -0.1770 -0.1491 0.1216 0.0981 0.1036 0.0949 0.1024 0.0907 0.0982 0.0962 0.1243 0.1149 0.0964 0.1421 0.0460 0.1190 0.1263 0.1616 0.1758 0.1062 0.1165 0.1409 0.1410 0.1585 0.1582 0.1591
va: 2.4469 2.1223 1.9983 2.0169 2.2559 3.7999 3.8031 3.9005 3.8950 3.8966 3.7995 4.1051 3.5627 3.9644 4.1735 3.9186 3.8402 3.6348 4.0087 3.9370 3.6397 3.8311 3.5989 3.8338 3.8860 3.8832 3.8876 3.8254 1.0036 1.0272 0.9996 1.0129 0.9993 1.0047 1.0017 1.0022 1.0287 1.0031 1.0061 1.0018 1.0409 1.0011 1.0042 1.0158 0.9986 1.0131 1.0062 1.0067 1.0025 0.9919 0.9912 0.9900
dispcorr: -0.033290134 hartree
energy: -1590.128219844355
dipole: 11.16707 -11.15924 0.00783 -1.88155 1.62720 -0.25435 -15.39417 13.34230 -2.05187
magnitude: 2.06759 au
magnitude: 5.25540 debye
