program: Orca
programVersion: 5.0.2
elementType: S O O O O C C C C C C C C C C C C C C C C C C C C C C C H H H H H H H H H H H H H H H H H H H H H H H H
charge: 0
multiplicity: 1
keywords: wb97x-d3
keywords: def2-TZVPP
keywords: def2/J RIJCOSX
keywords: DEFGRID2
keywords: scfconv7
keywords: smallprint printgap noloewdin
keywords: NOSOSCF
formula: C23H24O4S
InChI: InChI=1/C23H24O4S/c1-23(2)19(12-17-8-9-28-22(17)25)20(23)21(24)27-14-16-11-18(26-13-16)10-15-6-4-3-5-7-15/h3-7,11-13,19-20H,8-10,14H2,1-2H3
52 atoms
S  -1.621515 -2.033062 -1.900262
O  2.726467 2.343321 0.193157
O  1.865868 0.712828 1.455362
O  -0.627085 -3.047853 0.307464
O  -1.390789 2.365345 -0.883223
C  4.298147 -0.975377 0.511983
C  3.220255 -1.190206 -0.493293
C  3.623497 0.23479 -0.101471
C  4.095628 -1.345012 1.96055
C  5.715256 -1.205715 0.042265
C  1.892701 -1.730066 -0.151939
C  2.653789 1.079404 0.61399
C  0.861955 -1.686149 -1.001731
C  0.850731 -1.050101 -2.354805
C  -0.411191 -2.350145 -0.658613
C  -0.602498 -0.794634 -2.756941
C  1.778009 3.272518 0.732125
C  0.381329 2.957033 0.316192
C  -0.768931 2.920687 1.165072
C  -0.058434 2.613139 -0.916279
C  -1.81665 2.556635 0.38986
C  -3.239801 2.272444 0.697164
C  -3.54125 0.792192 0.782842
C  -2.807485 -0.029032 1.637085
C  -4.573567 0.230683 0.039968
C  -3.104264 -1.378381 1.749663
C  -4.868742 -1.123424 0.145619
C  -4.13461 -1.932127 0.999811
H  3.54546 -1.437189 -1.500116
H  4.204832 0.761347 -0.848392
H  4.406407 -2.3800 2.113715
H  4.718541 -0.718094 2.600202
H  3.071464 -1.256607 2.310572
H  6.420502 -0.61916 0.633152
H  5.98441 -2.257963 0.149303
H  5.846902 -0.932424 -1.005232
H  1.76147 -2.222241 0.80551
H  1.323003 -1.716244 -3.081574
H  1.408396 -0.112376 -2.366482
H  -0.755873 -0.88799 -3.829231
H  -0.937745 0.192544 -2.447095
H  1.851098 3.306353 1.820676
H  2.102646 4.240153 0.351888
H  -0.800876 3.129677 2.222906
H  0.431699 2.503861 -1.87102
H  -3.471705 2.747138 1.652928
H  -3.891127 2.73725 -0.046461
H  -1.998912 0.3910 2.224258
H  -5.152858 0.85661 -0.628475
H  -2.53038 -1.999349 2.425075
H  -5.672517 -1.54505 -0.444173
H  -4.36244 -2.986797 1.083211
elementType: S O C H
totalener: -1590.09428545 hartree
nucrepener: 2872.96394283 hartree
electener: -4463.05822828 hartree
oneelecener: -7888.28359634 hartree
twoeener: 3425.22536806 hartree
cpcmener: -0.04900019 hartree
kineticenergy: 1584.22484142 hartree
xcener: -135.012667852619 hartree
chargesum: -0.0000000
charge: -0.058230 -0.292473 -0.488502 -0.467271 -0.284981 0.124502 -0.064373 -0.059795 -0.289999 -0.258654 -0.083571 0.390063 -0.100877 -0.154012 0.280982 -0.110533 0.116108 -0.031690 -0.340417 -0.079478 0.213089 -0.044075 0.009472 -0.190144 -0.195520 -0.166955 -0.142266 -0.181069 0.121390 0.096805 0.102021 0.103989 0.091639 0.097846 0.096100 0.089998 0.130170 0.119101 0.096206 0.127047 0.107024 0.119631 0.119407 0.165232 0.179788 0.113748 0.105528 0.148164 0.142259 0.160050 0.159571 0.157955
qa: -0.0582 -0.2925 -0.4885 -0.4673 -0.2850 0.1245 -0.0644 -0.0598 -0.2900 -0.2587 -0.0836 0.3901 -0.1009 -0.1540 0.2810 -0.1105 0.1161 -0.0317 -0.3404 -0.0795 0.2131 -0.0441 0.0095 -0.1901 -0.1955 -0.1670 -0.1423 -0.1811 0.1214 0.0968 0.1020 0.1040 0.0916 0.0978 0.0961 0.0900 0.1302 0.1191 0.0962 0.1270 0.1070 0.1196 0.1194 0.1652 0.1798 0.1137 0.1055 0.1482 0.1423 0.1600 0.1596 0.1580
va: 2.4432 2.1267 1.9927 2.0085 2.2523 3.7990 3.8443 3.8719 3.8952 3.8944 3.7666 4.0960 3.5673 4.0020 4.1551 3.9341 3.8054 3.6030 3.9899 3.9272 3.6023 3.8203 3.6360 3.8801 3.9328 3.8369 3.8533 3.8766 1.0030 1.0305 0.9993 0.9992 1.0184 1.0021 1.0021 1.0042 1.0213 1.0028 1.0052 1.0121 1.0180 1.0055 0.9935 1.0039 0.9929 1.0042 1.0130 1.0038 1.0018 0.9956 0.9881 0.9911
dispcorr: -0.031370071 hartree
energy: -1590.125655518659
dipole: 16.49592 -14.25097 2.24495 -0.00120 2.10995 2.10875 2.31990 -4.14682 -1.82692
magnitude: 3.58110 au
magnitude: 9.10244 debye
