program: Orca
programVersion: 5.0.2
elementType: S O O O O C C C C C C C C C C C C C C C C C C C C C C C H H H H H H H H H H H H H H H H H H H H H H H H
charge: 0
multiplicity: 1
keywords: wb97x-d3
keywords: def2-TZVPP
keywords: def2/J RIJCOSX
keywords: DEFGRID2
keywords: scfconv7
keywords: smallprint printgap noloewdin
keywords: NOSOSCF
formula: C23H24O4S
InChI: InChI=1/C23H24O4S/c1-23(2)19(12-17-8-9-28-22(17)25)20(23)21(24)27-14-16-11-18(26-13-16)10-15-6-4-3-5-7-15/h3-7,11-13,19-20H,8-10,14H2,1-2H3
52 atoms
S  -1.329278 -2.592316 0.391218
O  2.52277 2.314355 -0.020759
O  2.091806 0.539057 1.270618
O  0.769874 -4.054847 1.001329
O  -1.525411 2.406368 -1.125859
C  4.647382 -0.605969 -0.233325
C  3.435952 -1.163492 -0.892623
C  3.528471 0.336749 -0.645918
C  4.904461 -0.894677 1.223935
C  5.908777 -0.491461 -1.053542
C  2.503771 -2.05742 -0.171788
C  2.647915 1.02501 0.31352
C  1.182925 -2.103738 -0.353345
C  0.328503 -1.231237 -1.213743
C  0.370637 -3.07125 0.419203
C  -0.981933 -1.018825 -0.459441
C  1.57631 3.103838 0.700291
C  0.191592 2.850222 0.209473
C  -1.022791 2.949618 0.959771
C  -0.177679 2.518408 -1.049876
C  -2.033187 2.674912 0.100475
C  -3.505814 2.570876 0.266179
C  -3.975478 1.145411 0.106021
C  -4.375303 0.662939 -1.136255
C  -3.954072 0.273709 1.191504
C  -4.745238 -0.667315 -1.291901
C  -4.326411 -1.054245 1.040042
C  -4.720651 -1.529804 -0.204689
H  3.530906 -1.407655 -1.947776
H  3.742641 0.927356 -1.528429
H  5.471557 -0.081835 1.680028
H  4.002033 -1.040146 1.812943
H  5.502246 -1.803088 1.315065
H  6.480813 -1.419613 -1.004856
H  5.692836 -0.286419 -2.102508
H  6.545446 0.311847 -0.67914
H  2.946667 -2.755669 0.53259
H  0.124475 -1.734476 -2.162905
H  0.795469 -0.275268 -1.450223
H  -1.81426 -0.78508 -1.118923
H  -0.889694 -0.232345 0.289222
H  1.649461 2.933995 1.775368
H  1.874364 4.135191 0.513163
H  -1.122768 3.189744 2.006745
H  0.375064 2.340894 -1.958894
H  -3.757349 2.945223 1.258975
H  -4.011353 3.215949 -0.457317
H  -4.398403 1.330868 -1.98926
H  -3.640997 0.638704 2.162988
H  -5.051128 -1.030064 -2.264882
H  -4.307958 -1.719035 1.89378
H  -5.007417 -2.566336 -0.324685
elementType: S O C H
totalener: -1590.09541807 hartree
nucrepener: 2847.61800323 hartree
electener: -4437.71342130 hartree
oneelecener: -7835.99047339 hartree
twoeener: 3398.27705209 hartree
cpcmener: -0.04419248 hartree
kineticenergy: 1584.20885598 hartree
xcener: -135.011689454289 hartree
chargesum: -0.0000000
charge: -0.058829 -0.292532 -0.482703 -0.457328 -0.284909 0.122200 -0.032563 -0.098530 -0.294340 -0.261784 -0.123815 0.385788 -0.083128 -0.127563 0.274037 -0.114862 0.116279 -0.023539 -0.328223 -0.082568 0.178395 -0.049274 0.039311 -0.179588 -0.174851 -0.149431 -0.181275 -0.170397 0.120889 0.099407 0.104155 0.095701 0.103015 0.095348 0.089759 0.097351 0.132550 0.117418 0.089043 0.134099 0.105082 0.115708 0.119858 0.162947 0.173700 0.111599 0.114606 0.140024 0.141011 0.157481 0.157721 0.157552
qa: -0.0588 -0.2925 -0.4827 -0.4573 -0.2849 0.1222 -0.0326 -0.0985 -0.2943 -0.2618 -0.1238 0.3858 -0.0831 -0.1276 0.2740 -0.1149 0.1163 -0.0235 -0.3282 -0.0826 0.1784 -0.0493 0.0393 -0.1796 -0.1749 -0.1494 -0.1813 -0.1704 0.1209 0.0994 0.1042 0.0957 0.1030 0.0953 0.0898 0.0974 0.1325 0.1174 0.0890 0.1341 0.1051 0.1157 0.1199 0.1629 0.1737 0.1116 0.1146 0.1400 0.1410 0.1575 0.1577 0.1576
va: 2.4634 2.1224 1.9982 2.0255 2.2491 3.7490 3.8820 3.8748 3.9053 3.9008 3.8669 4.0865 3.5430 4.0350 4.2197 3.8923 3.8045 3.5793 3.9912 3.9119 3.6360 3.8147 3.5740 3.9064 3.8547 3.8725 3.8205 3.8191 1.0052 1.0306 1.0002 1.0129 0.9987 1.0019 1.0044 1.0017 1.0122 1.0082 1.0169 1.0179 1.0220 1.0145 0.9921 1.0045 0.9976 1.0103 1.0056 1.0074 1.0033 0.9906 0.9963 0.9931
dispcorr: -0.032556223 hartree
energy: -1590.127974294236
dipole: 13.75567 -12.99649 0.75918 5.09578 -2.14230 2.95348 -3.54774 1.70684 -1.84090
magnitude: 3.56207 au
magnitude: 9.05407 debye
