program: Orca
programVersion: 5.0.2
elementType: S O O O O C C C C C C C C C C C C C C C C C C C C C C C H H H H H H H H H H H H H H H H H H H H H H H H
charge: 0
multiplicity: 1
keywords: wb97x-d3
keywords: def2-TZVPP
keywords: def2/J RIJCOSX
keywords: DEFGRID2
keywords: scfconv7
keywords: smallprint printgap noloewdin
keywords: NOSOSCF
formula: C23H24O4S
InChI: InChI=1/C23H24O4S/c1-23(2)19(12-17-8-9-28-22(17)25)20(23)21(24)27-14-16-11-18(26-13-16)10-15-6-4-3-5-7-15/h3-7,11-13,19-20H,8-10,14H2,1-2H3
52 atoms
S  -1.384991 -2.564201 0.708611
O  2.442531 2.227138 -0.464737
O  2.285464 0.711036 1.171925
O  0.738585 -3.671356 1.793436
O  -1.846119 3.241928 -0.539272
C  4.607558 -0.68678 -0.437266
C  3.327837 -1.331554 -0.834498
C  3.441216 0.189319 -0.866589
C  5.066727 -0.721718 0.998118
C  5.746877 -0.746435 -1.425269
C  2.454583 -2.032275 0.128204
C  2.672786 1.029123 0.069854
C  1.138097 -2.166878 -0.043663
C  0.303802 -1.587403 -1.138486
C  0.328977 -2.915702 0.940034
C  -1.070887 -1.284775 -0.547516
C  1.708415 3.199247 0.300352
C  0.235119 3.014401 0.198654
C  -0.648937 2.277608 1.054668
C  -0.555374 3.572119 -0.748412
C  -1.900503 2.453806 0.566541
C  -3.24051 1.985163 1.009356
C  -3.798981 0.837408 0.198328
C  -4.036859 0.962568 -1.169822
C  -4.090898 -0.374323 0.816269
C  -4.540442 -0.10366 -1.90081
C  -4.60256 -1.441666 0.088147
C  -4.824074 -1.311404 -1.274827
H  3.293167 -1.755083 -1.834931
H  3.53724 0.618019 -1.85669
H  4.25947 -0.711776 1.725703
H  5.650387 -1.627873 1.16977
H  5.714473 0.130502 1.209128
H  6.328445 -1.658434 -1.279334
H  5.391152 -0.739228 -2.456177
H  6.420236 0.102433 -1.296231
H  2.917667 -2.484857 0.9995
H  0.205227 -2.311427 -1.952058
H  0.739632 -0.68151 -1.560768
H  -1.863478 -1.318463 -1.29112
H  -1.087161 -0.310264 -0.062375
H  2.039531 3.195553 1.339096
H  1.9955 4.153907 -0.13715
H  -0.386205 1.706902 1.931285
H  -0.344415 4.215544 -1.588554
H  -3.156762 1.680787 2.052978
H  -3.940666 2.825725 0.987888
H  -3.834321 1.898758 -1.674745
H  -3.914327 -0.487345 1.879166
H  -4.715942 0.01119 -2.962774
H  -4.823453 -2.375785 0.588244
H  -5.217236 -2.142132 -1.846225
elementType: S O C H
totalener: -1590.09489910 hartree
nucrepener: 2827.54943852 hartree
electener: -4417.64433762 hartree
oneelecener: -7795.73737540 hartree
twoeener: 3378.09303778 hartree
cpcmener: -0.04231581 hartree
kineticenergy: 1584.21468444 hartree
xcener: -135.011521402087 hartree
chargesum: 0.0000000
charge: -0.063770 -0.289429 -0.497959 -0.459945 -0.284428 0.116174 -0.036169 -0.100432 -0.292898 -0.260347 -0.123773 0.429887 -0.093331 -0.129276 0.276724 -0.085062 0.069024 -0.075134 -0.319142 -0.035601 0.225558 -0.046340 0.004805 -0.180952 -0.172612 -0.165167 -0.164237 -0.155036 0.122282 0.098632 0.093517 0.103635 0.103435 0.094960 0.089646 0.097770 0.130938 0.116150 0.098702 0.127410 0.079716 0.121090 0.122805 0.160197 0.178210 0.098967 0.116819 0.138637 0.138198 0.158099 0.160095 0.158956
qa: -0.0638 -0.2894 -0.4980 -0.4599 -0.2844 0.1162 -0.0362 -0.1004 -0.2929 -0.2603 -0.1238 0.4299 -0.0933 -0.1293 0.2767 -0.0851 0.0690 -0.0751 -0.3191 -0.0356 0.2256 -0.0463 0.0048 -0.1810 -0.1726 -0.1652 -0.1642 -0.1550 0.1223 0.0986 0.0935 0.1036 0.1034 0.0950 0.0896 0.0978 0.1309 0.1162 0.0987 0.1274 0.0797 0.1211 0.1228 0.1602 0.1782 0.0990 0.1168 0.1386 0.1382 0.1581 0.1601 0.1590
va: 2.4569 2.1199 1.9875 2.0240 2.2704 3.7704 3.8660 3.8685 3.9010 3.8993 3.8586 4.0455 3.5593 4.0410 4.2171 3.8890 3.8509 3.6192 3.9291 3.9720 3.5909 3.8020 3.6312 3.9066 3.8093 3.8986 3.8095 3.8645 1.0045 1.0304 1.0153 0.9982 1.0001 1.0022 1.0043 1.0019 1.0144 1.0056 1.0052 1.0150 1.0412 1.0068 0.9967 1.0175 0.9927 1.0133 1.0028 1.0196 1.0102 0.9915 0.9932 0.9902
dispcorr: -0.031350069 hartree
energy: -1590.126249165377
dipole: 14.27689 -13.62247 0.65442 2.28480 -0.03432 2.25048 -7.29622 4.71229 -2.58393
magnitude: 3.48849 au
magnitude: 8.86704 debye
