program: Orca
programVersion: 5.0.2
elementType: S O O O O C C C C C C C C C C C C C C C C C C C C C C C H H H H H H H H H H H H H H H H H H H H H H H H
charge: 0
multiplicity: 1
keywords: wb97x-d3
keywords: def2-TZVPP
keywords: def2/J RIJCOSX
keywords: DEFGRID2
keywords: scfconv7
keywords: smallprint printgap noloewdin
keywords: NOSOSCF
formula: C23H24O4S
InChI: InChI=1/C23H24O4S/c1-23(2)19(12-17-8-9-28-22(17)25)20(23)21(24)27-14-16-11-18(26-13-16)10-15-6-4-3-5-7-15/h3-7,11-13,19-20H,8-10,14H2,1-2H3
52 atoms
S  -1.170084 -3.023691 0.060712
O  2.558256 2.324836 -1.114017
O  2.733028 1.859588 1.063411
O  0.005518 -1.803319 2.066121
O  -1.22672 0.558108 -0.634547
C  4.746823 -0.362174 0.294202
C  3.482776 -0.883756 -0.34009
C  3.949842 0.569969 -0.563208
C  4.870008 -0.203347 1.790253
C  6.033414 -0.845478 -0.335986
C  2.271157 -1.154059 0.435679
C  3.050783 1.638066 -0.080811
C  1.248844 -1.904185 0.006211
C  1.102896 -2.599874 -1.311228
C  0.099519 -2.132445 0.904024
C  -0.38737 -2.819199 -1.567986
C  1.385032 3.114449 -0.860675
C  0.228858 2.228714 -0.535698
C  -0.605679 2.265505 0.625327
C  -0.198472 1.168282 -1.262004
C  -1.473337 1.232058 0.513965
C  -2.584059 0.743716 1.370452
C  -3.893422 0.673568 0.623217
C  -4.432909 -0.551812 0.248396
C  -4.5701 1.841178 0.276275
C  -5.631634 -0.613621 -0.452018
C  -5.766182 1.783113 -0.423863
C  -6.301259 0.553625 -0.790758
H  3.613693 -1.505145 -1.218302
H  4.332055 0.744695 -1.562688
H  5.611908 0.562943 2.023644
H  3.951127 0.068028 2.299958
H  5.22266 -1.141405 2.222417
H  6.845131 -0.144439 -0.134108
H  6.318668 -1.814891 0.075246
H  5.946013 -0.952043 -1.41762
H  2.191277 -0.72655 1.428363
H  1.613118 -3.565439 -1.278287
H  1.538317 -2.030122 -2.131436
H  -0.576259 -3.706829 -2.166656
H  -0.842009 -1.964101 -2.065166
H  1.56147 3.839594 -0.065664
H  1.226037 3.667568 -1.784027
H  -0.560245 2.977043 1.43499
H  0.125709 0.738925 -2.19739
H  -2.341671 -0.241657 1.77826
H  -2.666722 1.422963 2.220379
H  -3.912947 -1.466453 0.50887
H  -4.157227 2.803264 0.557663
H  -6.040748 -1.575558 -0.733307
H  -6.282856 2.698205 -0.68388
H  -7.234744 0.507651 -1.336442
elementType: S O C H
totalener: -1590.09419941 hartree
nucrepener: 2833.52405409 hartree
electener: -4423.61825350 hartree
oneelecener: -7808.73841833 hartree
twoeener: 3385.12016483 hartree
cpcmener: -0.04636960 hartree
kineticenergy: 1584.21903120 hartree
xcener: -135.010617017133 hartree
chargesum: -0.0000000
charge: -0.066820 -0.288898 -0.472395 -0.465660 -0.276523 0.110740 0.014072 -0.067947 -0.279872 -0.262555 -0.130844 0.377247 -0.128493 -0.153611 0.296842 -0.110486 0.095683 -0.030893 -0.326632 -0.069747 0.186378 -0.060789 0.044150 -0.182061 -0.194783 -0.180157 -0.166297 -0.164924 0.113230 0.104436 0.103097 0.095616 0.096551 0.097351 0.097765 0.090857 0.125046 0.115035 0.097141 0.129778 0.111980 0.119094 0.123175 0.162960 0.172716 0.103879 0.121656 0.149019 0.144660 0.158849 0.160585 0.160796
qa: -0.0668 -0.2889 -0.4724 -0.4657 -0.2765 0.1107 0.0141 -0.0679 -0.2799 -0.2626 -0.1308 0.3772 -0.1285 -0.1536 0.2968 -0.1105 0.0957 -0.0309 -0.3266 -0.0697 0.1864 -0.0608 0.0441 -0.1821 -0.1948 -0.1802 -0.1663 -0.1649 0.1132 0.1044 0.1031 0.0956 0.0966 0.0974 0.0978 0.0909 0.1250 0.1150 0.0971 0.1298 0.1120 0.1191 0.1232 0.1630 0.1727 0.1039 0.1217 0.1490 0.1447 0.1588 0.1606 0.1608
va: 2.4301 2.1106 2.0184 2.0130 2.2393 3.7863 3.7805 3.8343 3.8835 3.8994 3.8181 4.1843 3.5839 4.0026 4.1582 3.9253 3.8191 3.6016 4.0137 3.9224 3.5937 3.8054 3.5555 3.9151 3.9457 3.9391 3.8969 3.8898 1.0053 1.0287 0.9984 1.0160 1.0011 1.0021 1.0022 1.0041 1.0347 1.0013 1.0065 1.0118 1.0102 1.0056 0.9947 1.0058 0.9965 1.0155 1.0089 1.0048 1.0031 0.9917 0.9899 0.9891
dispcorr: -0.030863995 hartree
energy: -1590.125063404288
dipole: 14.46633 -12.96160 1.50474 -0.29458 0.17781 -0.11678 -4.08916 0.98107 -3.10809
magnitude: 3.45515 au
magnitude: 8.78230 debye
