program: Orca
programVersion: 5.0.2
elementType: S O O O O C C C C C C C C C C C C C C C C C C C C C C C H H H H H H H H H H H H H H H H H H H H H H H H
charge: 0
multiplicity: 1
keywords: wb97x-d3
keywords: def2-TZVPP
keywords: def2/J RIJCOSX
keywords: DEFGRID2
keywords: scfconv7
keywords: smallprint printgap noloewdin
keywords: NOSOSCF
formula: C23H24O4S
InChI: InChI=1/C23H24O4S/c1-23(2)19(12-17-8-9-28-22(17)25)20(23)21(24)27-14-16-11-18(26-13-16)10-15-6-4-3-5-7-15/h3-7,11-13,19-20H,8-10,14H2,1-2H3
52 atoms
S  -1.132323 -3.025056 -0.298419
O  2.525997 2.486559 -0.820917
O  2.696263 1.783291 1.292567
O  0.0363 -2.079482 1.85444
O  -1.234888 0.617837 -0.587544
C  4.743108 -0.326362 0.26011
C  3.477551 -0.769069 -0.430832
C  3.937014 0.702309 -0.466926
C  4.869431 -0.371054 1.763353
C  6.026235 -0.717585 -0.437399
C  2.276216 -1.152789 0.312475
C  3.02364 1.696483 0.132821
C  1.267395 -1.865421 -0.205104
C  1.130089 -2.38693 -1.601762
C  0.130058 -2.240167 0.657456
C  -0.357746 -2.590038 -1.884676
C  1.334371 3.222739 -0.501995
C  0.193496 2.286576 -0.282769
C  -0.63089 2.158023 0.87999
C  -0.222179 1.321075 -1.136801
C  -1.48071 1.130903 0.641943
C  -2.575806 0.513121 1.432026
C  -3.889183 0.531328 0.690177
C  -4.596207 1.72174 0.537262
C  -4.398139 -0.629953 0.120016
C  -5.79068 1.748147 -0.167472
C  -5.595357 -0.607416 -0.585011
C  -6.294325 0.581989 -0.731737
H  3.608846 -1.272698 -1.381434
H  4.318139 1.001334 -1.436654
H  5.670207 0.295675 2.086607
H  3.973205 -0.088191 2.305959
H  5.139582 -1.381759 2.07274
H  5.921316 -0.706109 -1.522875
H  6.832021 -0.03106 -0.172535
H  6.331979 -1.722218 -0.141427
H  2.19717 -0.855973 1.352013
H  1.652488 -3.342562 -1.692988
H  1.557216 -1.710448 -2.341416
H  -0.535224 -3.390862 -2.598236
H  -0.825786 -1.682123 -2.260732
H  1.487841 3.868298 0.363432
H  1.173002 3.861819 -1.368087
H  -0.59097 2.75994 1.774321
H  0.102428 1.020727 -2.121077
H  -2.317857 -0.516311 1.695514
H  -2.658233 1.064772 2.369901
H  -4.207838 2.634892 0.973599
H  -3.854557 -1.5610 0.230095
H  -6.330175 2.680116 -0.276959
H  -5.979782 -1.520635 -1.020815
H  -7.226245 0.602099 -1.281535
elementType: S O C H
totalener: -1590.09412631 hartree
nucrepener: 2834.83605865 hartree
electener: -4424.93018496 hartree
oneelecener: -7811.28598444 hartree
twoeener: 3386.35579948 hartree
cpcmener: -0.04619825 hartree
kineticenergy: 1584.22190401 hartree
xcener: -135.011189838464 hartree
chargesum: 0.0000000
charge: -0.067036 -0.287840 -0.471832 -0.465222 -0.276927 0.111904 0.021432 -0.075862 -0.279382 -0.262081 -0.132811 0.379888 -0.129938 -0.152689 0.297255 -0.109909 0.092910 -0.032225 -0.326185 -0.066869 0.187842 -0.062874 0.048672 -0.196095 -0.183584 -0.164189 -0.180613 -0.165403 0.111705 0.103601 0.101356 0.095194 0.099097 0.090707 0.097770 0.097169 0.124339 0.115401 0.096847 0.129484 0.111199 0.119951 0.123361 0.162552 0.172650 0.104354 0.120915 0.143727 0.149997 0.159789 0.157879 0.160624
qa: -0.0670 -0.2878 -0.4718 -0.4652 -0.2769 0.1119 0.0214 -0.0759 -0.2794 -0.2621 -0.1328 0.3799 -0.1299 -0.1527 0.2973 -0.1099 0.0929 -0.0322 -0.3262 -0.0669 0.1878 -0.0629 0.0487 -0.1961 -0.1836 -0.1642 -0.1806 -0.1654 0.1117 0.1036 0.1014 0.0952 0.0991 0.0907 0.0978 0.0972 0.1243 0.1154 0.0968 0.1295 0.1112 0.1200 0.1234 0.1626 0.1726 0.1044 0.1209 0.1437 0.1500 0.1598 0.1579 0.1606
va: 2.4284 2.1095 2.0196 2.0132 2.2399 3.7820 3.7681 3.8396 3.8804 3.9002 3.8248 4.1856 3.5852 4.0019 4.1564 3.9252 3.8213 3.6007 4.0125 3.9209 3.5919 3.8074 3.5491 3.9471 3.9120 3.8952 3.9417 3.8886 1.0054 1.0297 0.9988 1.0182 1.0004 1.0041 1.0024 1.0023 1.0342 1.0014 1.0066 1.0123 1.0109 1.0044 0.9949 1.0063 0.9962 1.0148 1.0095 1.0031 1.0054 0.9901 0.9921 0.9890
dispcorr: -0.030952791 hartree
energy: -1590.125079103493
dipole: 14.43296 -12.92729 1.50567 0.39290 -0.08567 0.30723 -4.18622 1.06504 -3.12118
magnitude: 3.47896 au
magnitude: 8.84282 debye
