program: Orca
programVersion: 5.0.2
elementType: S O O O O C C C C C C C C C C C C C C C C C C C C C C C H H H H H H H H H H H H H H H H H H H H H H H H
charge: 0
multiplicity: 1
keywords: wb97x-d3
keywords: def2-TZVPP
keywords: def2/J RIJCOSX
keywords: DEFGRID2
keywords: scfconv7
keywords: smallprint printgap noloewdin
keywords: NOSOSCF
formula: C23H24O4S
InChI: InChI=1/C23H24O4S/c1-23(2)19(12-17-8-9-28-22(17)25)20(23)21(24)27-14-16-11-18(26-13-16)10-15-6-4-3-5-7-15/h3-7,11-13,19-20H,8-10,14H2,1-2H3
52 atoms
S  -1.369234 -2.238646 1.836044
O  2.507813 1.290725 0.414131
O  2.131022 2.270529 -1.556411
O  0.971647 -1.879111 2.970254
O  -1.642723 1.41209 1.685889
C  4.207542 -0.750344 -1.103928
C  2.834043 -1.29724 -0.930212
C  3.021847 0.089943 -1.546591
C  5.047245 -0.369169 0.089367
C  5.02897 -1.316955 -2.238266
C  2.214132 -1.497275 0.393573
C  2.520861 1.32161 -0.908473
C  0.899161 -1.644249 0.572779
C  -0.17188 -1.511534 -0.46015
C  0.360741 -1.89757 1.924498
C  -1.391984 -2.295482 0.017209
C  1.847611 2.350106 1.133596
C  0.372945 2.156067 1.125175
C  -0.584353 2.633164 0.171434
C  -0.334042 1.42101 2.016407
C  -1.789733 2.154512 0.558762
C  -3.148615 2.248857 -0.031683
C  -3.532858 1.002635 -0.796841
C  -2.875715 0.685211 -1.984076
C  -4.539101 0.158133 -0.341811
C  -3.223902 -0.44579 -2.706611
C  -4.893058 -0.975857 -1.065099
C  -4.238441 -1.279645 -2.249897
H  2.508348 -2.023685 -1.670594
H  2.874801 0.125708 -2.619443
H  4.481422 -0.010227 0.944031
H  5.620764 -1.237069 0.419442
H  5.760586 0.408928 -0.186215
H  5.7679 -0.592881 -2.585198
H  5.565004 -2.208796 -1.908778
H  4.408228 -1.597036 -3.089958
H  2.867707 -1.570774 1.256836
H  0.143722 -1.867331 -1.441224
H  -0.43261 -0.453872 -0.57146
H  -1.347377 -3.337088 -0.29681
H  -2.326562 -1.867104 -0.335867
H  2.241307 2.274329 2.144983
H  2.132508 3.322471 0.732635
H  -0.398624 3.259996 -0.685869
H  -0.049905 0.891583 2.912642
H  -3.886913 2.449171 0.747959
H  -3.158025 3.108154 -0.70453
H  -2.086368 1.332859 -2.348481
H  -5.057919 0.391594 0.58043
H  -2.705899 -0.675377 -3.628947
H  -5.680966 -1.621721 -0.699445
H  -4.513628 -2.161359 -2.813878
elementType: S O C H
totalener: -1590.09432554 hartree
nucrepener: 2902.90830770 hartree
electener: -4493.00263324 hartree
oneelecener: -7946.18425302 hartree
twoeener: 3453.18161978 hartree
cpcmener: -0.04114608 hartree
kineticenergy: 1584.22146600 hartree
xcener: -135.013667759556 hartree
chargesum: 0.0000000
charge: -0.062731 -0.265312 -0.503243 -0.462896 -0.273440 0.118469 -0.050880 -0.117073 -0.289151 -0.265094 -0.043903 0.435952 -0.158076 -0.099401 0.284388 -0.063058 0.048588 -0.069954 -0.284794 -0.054268 0.187918 -0.057977 0.055688 -0.225492 -0.204649 -0.150447 -0.126005 -0.176937 0.120070 0.095532 0.094311 0.101705 0.103790 0.097907 0.096090 0.089866 0.129522 0.109020 0.079676 0.130666 0.055258 0.117893 0.126639 0.159214 0.179116 0.107419 0.119170 0.146437 0.141691 0.158874 0.157104 0.156810
qa: -0.0627 -0.2653 -0.5032 -0.4629 -0.2734 0.1185 -0.0509 -0.1171 -0.2892 -0.2651 -0.0439 0.4360 -0.1581 -0.0994 0.2844 -0.0631 0.0486 -0.0700 -0.2848 -0.0543 0.1879 -0.0580 0.0557 -0.2255 -0.2046 -0.1504 -0.1260 -0.1769 0.1201 0.0955 0.0943 0.1017 0.1038 0.0979 0.0961 0.0899 0.1295 0.1090 0.0797 0.1307 0.0553 0.1179 0.1266 0.1592 0.1791 0.1074 0.1192 0.1464 0.1417 0.1589 0.1571 0.1568
va: 2.4487 2.1189 1.9943 2.0177 2.2594 3.7783 3.8328 3.8896 3.8984 3.9019 3.7643 4.0904 3.5836 3.9772 4.1634 3.9610 3.8453 3.6354 3.9817 3.9388 3.6502 3.8091 3.5580 3.8731 3.9226 3.8511 3.8339 3.8611 1.0052 1.0286 1.0118 0.9987 1.0002 1.0018 1.0018 1.0053 1.0177 1.0101 1.0194 1.0089 1.0333 1.0008 1.0040 1.0175 1.0017 1.0129 1.0055 1.0057 1.0039 0.9917 0.9906 0.9917
dispcorr: -0.034093057 hartree
energy: -1590.128418600278
dipole: 11.81362 -11.68644 0.12718 -2.48891 2.03504 -0.45387 -14.79440 12.79559 -1.99881
magnitude: 2.05364 au
magnitude: 5.21993 debye
