program: Orca
programVersion: 5.0.2
elementType: S O O O O C C C C C C C C C C C C C C C C C C C C C C C H H H H H H H H H H H H H H H H H H H H H H H H
charge: 0
multiplicity: 1
keywords: wb97x-d3
keywords: def2-TZVPP
keywords: def2/J RIJCOSX
keywords: DEFGRID2
keywords: scfconv7
keywords: smallprint printgap noloewdin
keywords: NOSOSCF
formula: C23H24O4S
InChI: InChI=1/C23H24O4S/c1-23(2)19(12-17-8-9-28-22(17)25)20(23)21(24)27-14-16-11-18(26-13-16)10-15-6-4-3-5-7-15/h3-7,11-13,19-20H,8-10,14H2,1-2H3
52 atoms
S  -0.778028 -2.771648 1.338571
O  2.408365 1.5465 -0.022101
O  2.265756 1.631394 -2.249936
O  0.722681 -1.199672 2.809115
O  -1.78594 0.757587 1.147594
C  4.911604 -0.117124 -0.292527
C  3.763436 -1.066368 -0.305084
C  3.786818 0.114128 -1.283697
C  5.164726 0.802646 0.877194
C  6.194207 -0.604689 -0.926801
C  2.756164 -1.136898 0.77024
C  2.758492 1.170616 -1.24134
C  1.571814 -1.7374 0.620286
C  1.023059 -2.347171 -0.628688
C  0.614845 -1.766104 1.743989
C  -0.081368 -3.333768 -0.24598
C  1.297822 2.445014 0.150601
C  0.025512 1.686628 0.262587
C  -0.678144 0.965019 -0.758924
C  -0.694683 1.514576 1.394688
C  -1.763477 0.417682 -0.165905
C  -2.898268 -0.388235 -0.682935
C  -4.170156 0.42303 -0.743999
C  -4.487947 1.145916 -1.890582
C  -5.019247 0.500873 0.356075
C  -5.63242 1.929895 -1.939347
C  -6.163036 1.287496 0.311676
C  -6.472222 2.005849 -0.835845
H  3.927751 -2.013408 -0.812729
H  4.019011 -0.159211 -2.306102
H  5.854787 0.316041 1.569644
H  5.639448 1.72525 0.538088
H  4.277739 1.075188 1.442319
H  6.789916 0.234024 -1.291246
H  6.796154 -1.148627 -0.197026
H  6.006315 -1.272237 -1.768351
H  2.998551 -0.700808 1.733951
H  1.788322 -2.855489 -1.215842
H  0.60711 -1.555544 -1.258144
H  0.308773 -4.341084 -0.111976
H  -0.876093 -3.366663 -0.98767
H  1.504653 2.976714 1.077404
H  1.269808 3.1763 -0.656659
H  -0.414272 0.870032 -1.800304
H  -0.56017 1.864839 2.406561
H  -2.629955 -0.743759 -1.678213
H  -3.043672 -1.270937 -0.055038
H  -3.834493 1.092375 -2.753556
H  -4.788637 -0.060956 1.253587
H  -5.868349 2.482058 -2.839994
H  -6.813732 1.339303 1.175061
H  -7.363906 2.618246 -0.871598
elementType: S O C H
totalener: -1590.09332242 hartree
nucrepener: 2824.76308755 hartree
electener: -4414.85640997 hartree
oneelecener: -7790.38845388 hartree
twoeener: 3375.53204391 hartree
cpcmener: -0.04609204 hartree
kineticenergy: 1584.21809064 hartree
xcener: -135.011975180221 hartree
chargesum: 0.0000000
charge: -0.068366 -0.262591 -0.504632 -0.461767 -0.283651 0.118889 -0.068672 -0.109851 -0.278611 -0.265106 -0.039017 0.435941 -0.161307 -0.121435 0.305957 -0.128913 0.050022 -0.046428 -0.331293 -0.044364 0.194366 -0.039056 0.062109 -0.206508 -0.213323 -0.159208 -0.161045 -0.174015 0.120388 0.094325 0.099080 0.105366 0.089447 0.099078 0.095513 0.089902 0.129947 0.107838 0.112554 0.130869 0.120982 0.113666 0.125578 0.160438 0.178177 0.113079 0.109770 0.143757 0.141789 0.160201 0.159179 0.160950
qa: -0.0684 -0.2626 -0.5046 -0.4618 -0.2837 0.1189 -0.0687 -0.1099 -0.2786 -0.2651 -0.0390 0.4359 -0.1613 -0.1214 0.3060 -0.1289 0.0500 -0.0464 -0.3313 -0.0444 0.1944 -0.0391 0.0621 -0.2065 -0.2133 -0.1592 -0.1610 -0.1740 0.1204 0.0943 0.0991 0.1054 0.0894 0.0991 0.0955 0.0899 0.1299 0.1078 0.1126 0.1309 0.1210 0.1137 0.1256 0.1604 0.1782 0.1131 0.1098 0.1438 0.1418 0.1602 0.1592 0.1610
va: 2.4356 2.1192 1.9887 2.0155 2.2457 3.7904 3.8413 3.8867 3.8936 3.9000 3.7429 4.0943 3.5887 3.9566 4.1236 3.9553 3.8584 3.5876 3.9705 3.9255 3.5951 3.7685 3.5817 3.9445 3.9558 3.8928 3.8967 3.8921 1.0053 1.0292 0.9997 1.0000 1.0137 1.0013 1.0023 1.0048 1.0221 1.0089 1.0114 1.0053 1.0048 1.0016 1.0075 1.0205 0.9947 1.0104 1.0170 1.0042 1.0091 0.9901 0.9904 0.9895
dispcorr: -0.031467499 hartree
energy: -1590.124789919370
dipole: 14.80973 -13.47674 1.33299 0.26112 -1.42758 -1.16647 -8.54849 7.06962 -1.47887
magnitude: 2.30750 au
magnitude: 5.86520 debye
