program: Orca
programVersion: 5.0.2
elementType: S O O O O C C C C C C C C C C C C C C C C C C C C C C C H H H H H H H H H H H H H H H H H H H H H H H H
charge: 0
multiplicity: 1
keywords: wb97x-d3
keywords: def2-TZVPP
keywords: def2/J RIJCOSX
keywords: DEFGRID2
keywords: scfconv7
keywords: smallprint printgap noloewdin
keywords: NOSOSCF
formula: C23H24O4S
InChI: InChI=1/C23H24O4S/c1-23(2)19(12-17-8-9-28-22(17)25)20(23)21(24)27-14-16-11-18(26-13-16)10-15-6-4-3-5-7-15/h3-7,11-13,19-20H,8-10,14H2,1-2H3
52 atoms
S  -0.743478 -2.848363 1.142749
O  2.385599 1.522895 0.143444
O  2.217938 1.749917 -2.071388
O  0.772712 -1.457094 2.769145
O  -1.826465 0.601423 1.202886
C  4.931709 -0.058778 -0.266313
C  3.806966 -1.032489 -0.330425
C  3.78789 0.213439 -1.22496
C  5.180517 0.780533 0.962644
C  6.215061 -0.467345 -0.953488
C  2.810493 -1.201248 0.744608
C  2.734131 1.237706 -1.100462
C  1.628427 -1.791583 0.543395
C  1.091748 -2.287238 -0.760184
C  0.665318 -1.91722 1.654202
C  -0.046704 -3.271395 -0.483075
C  1.255288 2.382385 0.37783
C  -0.009674 1.60314 0.410876
C  -0.712592 0.98005 -0.674339
C  -0.734042 1.32948 1.52041
C  -1.802468 0.38517 -0.136692
C  -2.941917 -0.36028 -0.730556
C  -4.198289 0.477669 -0.761725
C  -5.025454 0.563038 0.354958
C  -4.525535 1.21378 -1.896827
C  -6.153842 1.37164 0.338364
C  -5.65616 2.018972 -1.918174
C  -6.472055 2.103401 -0.798285
H  3.985718 -1.938557 -0.903638
H  4.013474 0.017698 -2.266175
H  5.637936 1.731289 0.686714
H  4.295491 0.99707 1.552156
H  5.883527 0.257976 1.612612
H  6.027761 -1.078373 -1.836983
H  6.782499 0.410058 -1.267834
H  6.843386 -1.045928 -0.2745
H  3.057316 -0.847885 1.739982
H  1.85918 -2.769455 -1.365973
H  0.713565 -1.43947 -1.337294
H  0.310937 -4.298788 -0.446674
H  -0.834651 -3.207025 -1.229802
H  1.443086 2.835103 1.349719
H  1.224771 3.179679 -0.364457
H  -0.448133 0.981561 -1.719245
H  -0.60219 1.586353 2.559834
H  -2.661157 -0.651501 -1.743286
H  -3.117554 -1.281108 -0.168036
H  -4.789918 -0.009873 1.243857
H  -3.891149 1.154008 -2.773195
H  -6.786789 1.429007 1.214398
H  -5.899875 2.580724 -2.810721
H  -7.35247 2.732463 -0.812365
elementType: S O C H
totalener: -1590.09322547 hartree
nucrepener: 2822.96304102 hartree
electener: -4413.05626649 hartree
oneelecener: -7786.77900484 hartree
twoeener: 3373.72273835 hartree
cpcmener: -0.04583025 hartree
kineticenergy: 1584.22863177 hartree
xcener: -135.013955590024 hartree
chargesum: 0.0000000
charge: -0.066893 -0.263317 -0.504197 -0.462420 -0.283080 0.116939 -0.061553 -0.110302 -0.278698 -0.264994 -0.050400 0.435345 -0.148102 -0.123748 0.302683 -0.128934 0.050157 -0.048823 -0.332826 -0.039743 0.197578 -0.040830 0.063994 -0.216079 -0.205742 -0.160413 -0.156574 -0.175505 0.120616 0.094087 0.104916 0.089832 0.099142 0.089380 0.098964 0.095607 0.130013 0.108504 0.111899 0.131276 0.120596 0.113882 0.125468 0.160260 0.177150 0.110668 0.109489 0.141525 0.142934 0.159252 0.160089 0.160925
qa: -0.0669 -0.2633 -0.5042 -0.4624 -0.2831 0.1169 -0.0616 -0.1103 -0.2787 -0.2650 -0.0504 0.4353 -0.1481 -0.1237 0.3027 -0.1289 0.0502 -0.0488 -0.3328 -0.0397 0.1976 -0.0408 0.0640 -0.2161 -0.2057 -0.1604 -0.1566 -0.1755 0.1206 0.0941 0.1049 0.0898 0.0991 0.0894 0.0990 0.0956 0.1300 0.1085 0.1119 0.1313 0.1206 0.1139 0.1255 0.1603 0.1772 0.1107 0.1095 0.1415 0.1429 0.1593 0.1601 0.1609
va: 2.4379 2.1187 1.9884 2.0157 2.2451 3.7928 3.8400 3.8835 3.8942 3.9010 3.7514 4.0902 3.5853 3.9639 4.1293 3.9578 3.8574 3.5803 3.9709 3.9233 3.5990 3.7771 3.5852 3.9569 3.9448 3.8964 3.8887 3.8933 1.0051 1.0295 1.0002 1.0136 0.9997 1.0050 1.0014 1.0024 1.0219 1.0084 1.0114 1.0053 1.0047 1.0015 1.0067 1.0211 0.9954 1.0104 1.0154 1.0110 1.0044 0.9905 0.9900 0.9895
dispcorr: -0.031456344 hartree
energy: -1590.124681815074
dipole: 14.87369 -13.53448 1.33921 1.36075 -2.33977 -0.97901 -8.68888 7.10993 -1.57895
magnitude: 2.29020 au
magnitude: 5.82124 debye
