program: Orca
programVersion: 5.0.2
elementType: S O O O O C C C C C C C C C C C C C C C C C C C C C C C H H H H H H H H H H H H H H H H H H H H H H H H
charge: 0
multiplicity: 1
keywords: wb97x-d3
keywords: def2-TZVPP
keywords: def2/J RIJCOSX
keywords: DEFGRID2
keywords: scfconv7
keywords: smallprint printgap noloewdin
keywords: NOSOSCF
formula: C23H24O4S
InChI: InChI=1/C23H24O4S/c1-23(2)19(12-17-8-9-28-22(17)25)20(23)21(24)27-14-16-11-18(26-13-16)10-15-6-4-3-5-7-15/h3-7,11-13,19-20H,8-10,14H2,1-2H3
52 atoms
S  -1.051262 -1.74663 -2.535433
O  2.384841 2.244699 0.577905
O  1.551233 0.404923 1.532335
O  -0.375276 -3.091206 -0.386808
O  -1.359584 2.327278 -1.599784
C  4.309183 -0.897338 0.937451
C  3.495829 -1.081275 -0.292712
C  3.622265 0.311732 0.329245
C  3.862302 -1.484036 2.252845
C  5.810784 -0.905347 0.771516
C  2.198871 -1.787113 -0.309272
C  2.422715 0.951376 0.894619
C  1.246878 -1.511829 -1.205431
C  1.282959 -0.421657 -2.225744
C  -0.027495 -2.255643 -1.190631
C  0.230185 -0.706107 -3.298771
C  1.2067 2.992405 0.928862
C  0.021173 2.59155 0.120017
C  -1.102478 1.806231 0.537213
C  -0.193962 2.875182 -1.186063
C  -1.91224 1.680975 -0.539748
C  -3.226405 1.019088 -0.757378
C  -3.713548 0.365075 0.506204
C  -4.533593 1.058589 1.391162
C  -3.315451 -0.927791 0.833644
C  -4.949171 0.472807 2.579618
C  -3.729173 -1.517191 2.020257
C  -4.546317 -0.81707 2.898129
H  4.042612 -1.159583 -1.229456
H  4.272654 0.990393 -0.208785
H  4.261871 -2.495194 2.348346
H  4.256161 -0.897232 3.083995
H  2.784984 -1.547675 2.373142
H  6.290862 -0.320529 1.557698
H  6.195242 -1.924937 0.831964
H  6.116803 -0.489984 -0.189247
H  2.030672 -2.575877 0.416944
H  2.265746 -0.321248 -2.687011
H  1.062065 0.532749 -1.738904
H  0.652074 -1.247371 -4.143747
H  -0.232308 0.205366 -3.669764
H  1.001256 2.900838 1.996235
H  1.48349 4.026242 0.730473
H  -1.278363 1.4042 1.522013
H  0.369355 3.431907 -1.919025
H  -3.956024 1.758042 -1.101443
H  -3.13613 0.276296 -1.555659
H  -4.850455 2.066009 1.148219
H  -2.677731 -1.480213 0.154093
H  -5.588779 1.024482 3.256369
H  -3.414011 -2.524867 2.258327
H  -4.869602 -1.275754 3.82348
elementType: S O C H
totalener: -1590.09461939 hartree
nucrepener: 2858.56036068 hartree
electener: -4448.65498007 hartree
oneelecener: -7858.80674443 hartree
twoeener: 3410.15176437 hartree
cpcmener: -0.04493028 hartree
kineticenergy: 1584.21506653 hartree
xcener: -135.010926957211 hartree
chargesum: -0.0000000
charge: -0.063684 -0.288531 -0.488206 -0.459098 -0.282726 0.120114 -0.036366 -0.081710 -0.293218 -0.262877 -0.102352 0.398495 -0.094497 -0.099212 0.269318 -0.118130 0.075436 -0.094329 -0.248863 -0.033888 0.147959 -0.053029 0.030457 -0.178472 -0.173925 -0.165489 -0.179967 -0.158959 0.120302 0.094271 0.101461 0.102545 0.094275 0.098240 0.095407 0.089360 0.129591 0.107600 0.081689 0.129710 0.117828 0.123097 0.125996 0.157637 0.177120 0.111432 0.116494 0.140615 0.122458 0.159706 0.157710 0.161201
qa: -0.0637 -0.2885 -0.4882 -0.4591 -0.2827 0.1201 -0.0364 -0.0817 -0.2932 -0.2629 -0.1024 0.3985 -0.0945 -0.0992 0.2693 -0.1181 0.0754 -0.0943 -0.2489 -0.0339 0.1480 -0.0530 0.0305 -0.1785 -0.1739 -0.1655 -0.1800 -0.1590 0.1203 0.0943 0.1015 0.1025 0.0943 0.0982 0.0954 0.0894 0.1296 0.1076 0.0817 0.1297 0.1178 0.1231 0.1260 0.1576 0.1771 0.1114 0.1165 0.1406 0.1225 0.1597 0.1577 0.1612
va: 2.4282 2.1169 1.9969 2.0194 2.2432 3.7721 3.8673 3.8570 3.8935 3.8998 3.8012 4.0790 3.5561 3.9713 4.1482 3.9371 3.8444 3.6152 3.9137 3.9118 3.6681 3.8287 3.5548 3.9319 3.9019 3.8967 3.9412 3.8780 1.0062 1.0323 0.9985 0.9999 1.0167 1.0019 1.0022 1.0043 1.0163 1.0086 1.0376 1.0067 1.0096 1.0021 0.9942 1.0093 0.9941 1.0114 1.0054 1.0045 1.0169 0.9899 0.9923 0.9887
dispcorr: -0.031606690 hartree
energy: -1590.126226080703
dipole: 16.07591 -13.67828 2.39763 0.62276 1.59173 2.21448 6.70773 -8.17792 -1.47019
magnitude: 3.57967 au
magnitude: 9.09879 debye
