program: Orca
programVersion: 5.0.2
elementType: S O O O O C C C C C C C C C C C C C C C C C C C C C C C H H H H H H H H H H H H H H H H H H H H H H H H
charge: 0
multiplicity: 1
keywords: wb97x-d3
keywords: def2-TZVPP
keywords: def2/J RIJCOSX
keywords: DEFGRID2
keywords: scfconv7
keywords: smallprint printgap noloewdin
keywords: NOSOSCF
formula: C23H24O4S
InChI: InChI=1/C23H24O4S/c1-23(2)19(12-17-8-9-28-22(17)25)20(23)21(24)27-14-16-11-18(26-13-16)10-15-6-4-3-5-7-15/h3-7,11-13,19-20H,8-10,14H2,1-2H3
52 atoms
S  -1.178213 -2.180153 1.411819
O  1.92797 1.848835 -1.294506
O  3.064541 1.572293 0.606976
O  0.942375 -1.637909 2.861823
O  -1.099706 1.604741 1.962279
C  4.703147 -0.617641 -0.78263
C  3.350925 -1.246097 -0.755152
C  3.527441 0.1795 -1.293641
C  5.432792 -0.272711 0.493641
C  5.641398 -1.100008 -1.865471
C  2.572055 -1.438784 0.483424
C  2.857289 1.260751 -0.542949
C  1.245987 -1.600122 0.472879
C  0.348969 -1.578674 -0.722277
C  0.505259 -1.763298 1.740631
C  -0.920325 -2.356188 -0.381357
C  1.11363 2.860431 -0.673045
C  0.045055 2.280881 0.185761
C  -1.244888 1.813957 -0.23628
C  0.072724 2.118143 1.52883
C  -1.903003 1.424645 0.881422
C  -3.28385 0.944458 1.166314
C  -4.026962 0.538143 -0.076066
C  -4.461752 1.495621 -0.99052
C  -4.303145 -0.80134 -0.331268
C  -5.142144 1.120115 -2.139971
C  -4.98598 -1.181481 -1.479654
C  -5.404449 -0.221359 -2.389524
H  3.129352 -1.966666 -1.537707
H  3.439007 0.268013 -2.37016
H  4.789221 -0.07415 1.344931
H  6.083171 -1.106007 0.76444
H  6.066871 0.602527 0.347047
H  5.113579 -1.339338 -2.789542
H  6.38935 -0.339276 -2.09499
H  6.16843 -1.998278 -1.539886
H  3.094958 -1.447534 1.433899
H  0.822073 -2.004437 -1.607183
H  0.090378 -0.543397 -0.959936
H  -0.818438 -3.415139 -0.612725
H  -1.792358 -1.969036 -0.903962
H  1.737857 3.556169 -0.111921
H  0.675713 3.40463 -1.507643
H  -1.622899 1.797772 -1.246138
H  0.81644 2.327524 2.280992
H  -3.238137 0.103454 1.86198
H  -3.834835 1.738953 1.681451
H  -4.270027 2.545118 -0.800274
H  -3.993864 -1.556594 0.381515
H  -5.473071 1.876525 -2.839747
H  -5.193239 -2.228661 -1.658337
H  -5.937889 -0.514662 -3.284218
elementType: S O C H
totalener: -1590.09308468 hartree
nucrepener: 2854.90933494 hartree
electener: -4445.00241962 hartree
oneelecener: -7850.69606707 hartree
twoeener: 3405.69364745 hartree
cpcmener: -0.04365087 hartree
kineticenergy: 1584.21765669 hartree
xcener: -135.012763332494 hartree
chargesum: 0.0000000
charge: -0.077946 -0.284381 -0.483927 -0.457261 -0.283525 0.126581 -0.067812 -0.080222 -0.282688 -0.268097 -0.075973 0.396183 -0.129190 -0.117186 0.302302 -0.128953 0.081711 -0.073651 -0.314155 -0.019329 0.166640 -0.041519 0.083858 -0.238984 -0.263728 -0.139298 -0.148925 -0.180906 0.117514 0.097472 0.087366 0.096978 0.104067 0.089188 0.098169 0.097222 0.131510 0.108456 0.108243 0.130336 0.126930 0.124572 0.121955 0.164521 0.169613 0.107807 0.118748 0.148825 0.169252 0.160612 0.159946 0.161079
qa: -0.0779 -0.2844 -0.4839 -0.4573 -0.2835 0.1266 -0.0678 -0.0802 -0.2827 -0.2681 -0.0760 0.3962 -0.1292 -0.1172 0.3023 -0.1290 0.0817 -0.0737 -0.3142 -0.0193 0.1666 -0.0415 0.0839 -0.2390 -0.2637 -0.1393 -0.1489 -0.1809 0.1175 0.0975 0.0874 0.0970 0.1041 0.0892 0.0982 0.0972 0.1315 0.1085 0.1082 0.1303 0.1269 0.1246 0.1220 0.1645 0.1696 0.1078 0.1187 0.1488 0.1693 0.1606 0.1599 0.1611
va: 2.4409 2.1166 2.0048 2.0234 2.2445 3.7885 3.8724 3.8350 3.8883 3.9021 3.7769 4.1195 3.5591 3.9513 4.1389 3.9558 3.8101 3.5993 3.9176 3.9204 3.6508 3.8518 3.4717 3.9448 3.9332 3.8730 3.9140 3.9121 1.0074 1.0307 1.0175 1.0006 1.0001 1.0039 1.0018 1.0020 1.0179 1.0099 1.0226 1.0076 1.0038 1.0088 0.9940 1.0049 1.0057 1.0123 1.0027 1.0000 0.9794 0.9889 0.9915 0.9889
dispcorr: -0.032253141 hartree
energy: -1590.125337815998
dipole: 11.54726 -11.83697 -0.28971 -2.27468 2.07703 -0.19765 -14.94254 11.19417 -3.74837
magnitude: 3.76474 au
magnitude: 9.56922 debye
