program: Orca
programVersion: 5.0.3
elementType: Cl Cl Cl O O C C C C C C C C C C C C C C C C H H H H H H H H H H H H H H H
charge: 0
multiplicity: 1
keywords: wb97x-d3
keywords: def2-TZVPP
keywords: def2/J RIJCOSX
keywords: DEFGRID2
keywords: scfconv7
keywords: smallprint printgap noloewdin
keywords: NOSOSCF
formula: C16H15Cl3O2
InChI: InChI=1/C16H15Cl3O2/c1-20-13-7-3-11(4-8-13)15(16(17,18)19)12-5-9-14(21-2)10-6-12/h3-10,15H,1-2H3
36 atoms
Cl -1.498473 -2.942975 0.600915
Cl -0.324996 -1.955289 -1.809504
Cl 1.348379 -3.020459 0.286246
O  -4.42373 2.652402 -0.560248
O  4.719471 2.431194 0.32634
C  -0.004023 -0.683108 0.630331
C  -1.195344 0.197625 0.319655
C  1.303385 0.063764 0.454086
C  -0.100415 -2.061186 -0.054829
C  -2.294117 0.217813 1.163642
C  1.693197 0.887022 1.511401
C  -1.218838 1.030598 -0.798843
C  2.108995 0.049512 -0.673807
C  -3.397243 1.023237 0.910617
C  2.829042 1.664538 1.450024
C  -2.307037 1.831087 -1.071062
C  3.260234 0.825546 -0.753407
C  -3.411715 1.834248 -0.218243
C  3.628781 1.642625 0.307593
C  -5.552484 2.708501 0.27236
C  5.557567 2.441757 -0.799339
H  -0.058012 -0.940128 1.693242
H  -2.303064 -0.405137 2.04945
H  1.083145 0.926486 2.406334
H  -0.364747 1.071038 -1.461532
H  1.867602 -0.571792 -1.523748
H  -4.225834 1.003572 1.604866
H  3.110882 2.294326 2.283563
H  -2.312044 2.472952 -1.942223
H  3.853669 0.770418 -1.655599
H  -6.241602 3.414446 -0.185539
H  -5.30717 3.063816 1.278416
H  -6.054092 1.738981 0.357181
H  6.366873 3.133828 -0.577904
H  5.0387 2.789464 -1.698426
H  5.988952 1.456794 -1.004395
totalener: -2149.84394274 hartree
nucrepener: 2104.63233428 hartree
electener: -4254.47627702 hartree
oneelecener: -7139.11092919 hartree
twoeener: 2884.63465217 hartree
kineticenergy: 2144.56701059 hartree
xcener: -138.578769120113 hartree
chargesum: 0.0000000
charge: -0.052399 -0.056830 -0.043379 -0.283639 -0.284829 -0.065546 0.006703 0.105664 0.196921 -0.192472 -0.174948 -0.154504 -0.239096 -0.180318 -0.180396 -0.168515 -0.164392 0.266024 0.274459 -0.134310 -0.133691 0.122507 0.110163 0.101487 0.131497 0.123785 0.105693 0.116783 0.116194 0.104486 0.115886 0.098851 0.098920 0.115125 0.098767 0.099346
qa: -0.0524 -0.0568 -0.0434 -0.2836 -0.2848 -0.0655 0.0067 0.1057 0.1969 -0.1925 -0.1749 -0.1545 -0.2391 -0.1803 -0.1804 -0.1685 -0.1644 0.2660 0.2745 -0.1343 -0.1337 0.1225 0.1102 0.1015 0.1315 0.1238 0.1057 0.1168 0.1162 0.1045 0.1159 0.0989 0.0989 0.1151 0.0988 0.0993
va: 1.2490 1.2490 1.2614 2.1128 2.1117 3.8399 3.6659 3.5033 4.4093 4.1203 4.0901 4.0319 4.0448 3.9216 4.0229 4.0624 3.9516 3.9013 3.8890 3.9017 3.9024 1.0245 1.0240 1.0115 1.0036 1.0499 1.0203 1.0165 1.0173 1.0215 0.9978 0.9870 0.9867 0.9979 0.9870 0.9866
dispcorr: -0.018842637 hartree
energy: -2149.862785374617
dipole: 1.08283 -1.17070 -0.08787 31.92168 -31.14571 0.77597 2.84451 -2.71767 0.12684
magnitude: 0.79116 au
magnitude: 2.01097 debye
