program: Orca
programVersion: 5.0.3
elementType: Cl Cl Cl O O C C C C C C C C C C C C C C C C H H H H H H H H H H H H H H H
charge: 0
multiplicity: 1
keywords: wb97x-d3
keywords: def2-TZVPP
keywords: def2/J RIJCOSX
keywords: DEFGRID2
keywords: scfconv7
keywords: smallprint printgap noloewdin
keywords: NOSOSCF
formula: C16H15Cl3O2
InChI: InChI=1/C16H15Cl3O2/c1-20-13-7-3-11(4-8-13)15(16(17,18)19)12-5-9-14(21-2)10-6-12/h3-10,15H,1-2H3
36 atoms
Cl -1.579439 -2.877237 0.303501
Cl 0.360156 -2.122896 -1.686389
Cl 1.224281 -2.966397 0.894305
O  -4.684995 2.518818 -0.562303
O  4.65417 2.325328 -0.368529
C  -0.098731 -0.613415 0.602393
C  -1.349952 0.164488 0.249062
C  1.17271 0.167406 0.338375
C  -0.035802 -2.046483 0.039959
C  -1.966232 0.875433 1.271844
C  2.172033 0.203284 1.302151
C  -1.901113 0.266241 -1.028678
C  1.380085 0.884402 -0.840481
C  -3.079692 1.674454 1.049701
C  3.351866 0.911084 1.109956
C  -3.012668 1.051819 -1.267669
C  2.546587 1.592549 -1.050363
C  -3.61068 1.769236 -0.232439
C  3.547986 1.607938 -0.077507
C  -5.296712 3.292299 0.452859
C  5.689747 2.382039 0.595013
H  -0.149472 -0.776345 1.682745
H  -1.568792 0.813736 2.278136
H  2.033685 -0.32252 2.238591
H  -1.476543 -0.265417 -1.867781
H  0.620426 0.913806 -1.610139
H  -3.513281 2.206502 1.885359
H  4.094548 0.909505 1.896152
H  -3.423751 1.114381 -2.2675
H  2.68822 2.144322 -1.971422
H  -5.699371 2.669818 1.255767
H  -6.118324 3.826172 -0.018447
H  -4.605453 4.021834 0.882097
H  6.473299 3.003974 0.169129
H  6.104422 1.394046 0.80817
H  5.352464 2.835066 1.530347
elementType: Cl O C H
totalener: -2149.85212625 hartree
nucrepener: 2099.58746233 hartree
electener: -4249.43958859 hartree
oneelecener: -7129.96007691 hartree
twoeener: 2880.52048832 hartree
cpcmener: -0.02501562 hartree
kineticenergy: 2144.52151918 hartree
xcener: -138.570834939852 hartree
chargesum: 0.0000000
charge: -0.056104 -0.060356 -0.059959 -0.340072 -0.339905 0.021678 0.047555 0.013341 0.159466 -0.233416 -0.219762 -0.222440 -0.216304 -0.200063 -0.206071 -0.206438 -0.213754 0.290102 0.291677 -0.116977 -0.117810 0.128956 0.139196 0.142484 0.152434 0.159584 0.143476 0.143428 0.140226 0.139879 0.111803 0.123131 0.112182 0.123657 0.112573 0.112603
qa: -0.0561 -0.0604 -0.0600 -0.3401 -0.3399 0.0217 0.0476 0.0133 0.1595 -0.2334 -0.2198 -0.2224 -0.2163 -0.2001 -0.2061 -0.2064 -0.2138 0.2901 0.2917 -0.1170 -0.1178 0.1290 0.1392 0.1425 0.1524 0.1596 0.1435 0.1434 0.1402 0.1399 0.1118 0.1231 0.1122 0.1237 0.1126 0.1126
va: 1.2457 1.2438 1.2393 2.0552 2.0571 3.7001 3.4657 3.5915 4.4659 4.0510 4.0439 3.9837 4.0148 3.8343 3.8641 4.0550 4.0521 3.8074 3.8084 3.8589 3.8577 1.0326 1.0067 1.0139 1.0185 0.9953 1.0111 1.0114 1.0114 1.0117 0.9868 0.9938 0.9877 0.9939 0.9872 0.9873
dispcorr: -0.018756635 hartree
energy: -2149.870882887247
dipole: 0.91181 -0.67279 0.23902 34.02790 -32.68655 1.34135 6.96347 -5.35893 1.60454
magnitude: 2.10497 au
magnitude: 5.35041 debye
