program: Orca
programVersion: 5.0.2
elementType: Cl Cl O O O C C C C C C C C C C C C C C C C C C C C C H H H H H H H H H H H H H H H H H H H H
charge: 0
multiplicity: 1
keywords: wb97x-d3
keywords: def2-TZVPP
keywords: def2/J RIJCOSX
keywords: DEFGRID2
keywords: scfconv7
keywords: smallprint printgap noloewdin
keywords: NOSOSCF
formula: C21H20Cl2O3
InChI: InChI=1/C21H20Cl2O3/c1-21(2)17(12-18(22)23)19(21)20(24)25-13-14-7-6-10-16(11-14)26-15-8-4-3-5-9-15/h3-12,17,19H,13H2,1-2H3
46 atoms
Cl -5.348558 2.377342 0.48469
Cl -4.938212 -0.395879 1.152864
O  1.100208 2.365368 1.319238
O  -0.028743 0.512329 0.788776
O  3.851932 -2.318951 -0.565029
C  -1.335488 2.396146 -1.339372
C  -2.285527 2.388079 -0.176998
C  -0.806664 2.663386 0.054683
C  -1.389456 3.600214 -2.249895
C  -1.002667 1.120048 -2.072737
C  -2.943054 1.164033 0.29969
C  0.0914 1.709594 0.74257
C  -4.23269 1.072201 0.59967
C  2.142099 1.578469 1.902521
C  3.011638 0.96082 0.844335
C  3.015523 -0.414036 0.661306
C  3.790352 1.771578 0.02492
C  3.784452 -0.977084 -0.350088
C  4.564399 1.201291 -0.97196
C  4.560933 -0.170464 -1.169915
C  2.768392 -3.119797 -0.341391
C  1.472993 -2.738118 -0.669189
C  3.018532 -4.379064 0.185027
C  0.429963 -3.624826 -0.452326
C  1.966723 -5.259414 0.384444
C  0.667952 -4.886285 0.073051
H  -2.894321 3.280164 -0.085148
H  -0.569557 3.699679 0.264684
H  -1.641844 4.513081 -1.709294
H  -0.426727 3.75905 -2.738742
H  -2.140274 3.458913 -3.029042
H  -1.740504 0.951337 -2.858489
H  -0.024545 1.202863 -2.549501
H  -0.984884 0.238071 -1.440057
H  -2.349776 0.269485 0.426115
H  2.708155 2.285615 2.508498
H  1.727166 0.817624 2.566032
H  2.398603 -1.038104 1.294952
H  3.790014 2.845438 0.164396
H  5.173173 1.828759 -1.609395
H  5.156619 -0.621495 -1.952486
H  1.27111 -1.756732 -1.078172
H  4.033923 -4.661001 0.430759
H  -0.57867 -3.321757 -0.700004
H  2.166352 -6.240735 0.794216
H  -0.151798 -5.572075 0.238081
totalener: -1958.42546315 hartree
nucrepener: 2535.47024692 hartree
electener: -4493.89571007 hartree
oneelecener: -7724.21744024 hartree
twoeener: 3230.32173017 hartree
kineticenergy: 1952.62177885 hartree
xcener: -143.516164631386 hartree
chargesum: 0.0000000
charge: -0.052050 -0.047584 -0.265328 -0.412247 -0.298730 0.071554 0.048750 -0.092263 -0.235223 -0.248833 -0.228197 0.385311 0.037667 0.056107 -0.007083 -0.145613 -0.213230 0.252604 -0.074742 -0.223092 0.266052 -0.167983 -0.219268 -0.105280 -0.088780 -0.147565 0.077445 0.086121 0.073665 0.090867 0.092150 0.096508 0.094475 0.084685 0.131053 0.115536 0.104594 0.123812 0.112874 0.124349 0.125907 0.127022 0.122447 0.122568 0.124347 0.124619
qa: -0.0521 -0.0476 -0.2653 -0.4122 -0.2987 0.0716 0.0488 -0.0923 -0.2352 -0.2488 -0.2282 0.3853 0.0377 0.0561 -0.0071 -0.1456 -0.2132 0.2526 -0.0747 -0.2231 0.2661 -0.1680 -0.2193 -0.1053 -0.0888 -0.1476 0.0774 0.0861 0.0737 0.0909 0.0921 0.0965 0.0945 0.0847 0.1311 0.1155 0.1046 0.1238 0.1129 0.1243 0.1259 0.1270 0.1224 0.1226 0.1243 0.1246
va: 1.2767 1.2591 2.1392 2.0686 2.1177 3.7700 3.7907 3.8892 3.9134 3.9219 3.8926 4.1293 4.2474 3.8590 3.6733 3.8954 4.0190 3.8425 3.9200 4.0484 3.8061 3.9427 4.0396 3.9479 3.9300 3.9695 1.0353 1.0302 1.0089 1.0039 1.0042 1.0041 1.0007 1.0169 1.0361 0.9908 1.0114 1.0191 1.0148 0.9989 1.0133 1.0022 1.0152 1.0006 0.9989 1.0006
dispcorr: -0.023491573 hartree
energy: -1958.448954719702
dipole: 28.50472 -27.85618 0.64854 1.36174 -0.53719 0.82454 -13.51335 13.19763 -0.31572
magnitude: 1.09551 au
magnitude: 2.78457 debye
