program: Orca
programVersion: 5.0.2
elementType: Cl Cl O O O C C C C C C C C C C C C C C C C C C C C C H H H H H H H H H H H H H H H H H H H H
charge: 0
multiplicity: 1
keywords: wb97x-d3
keywords: def2-TZVPP
keywords: def2/J RIJCOSX
keywords: DEFGRID2
keywords: scfconv7
keywords: smallprint printgap noloewdin
keywords: NOSOSCF
formula: C21H20Cl2O3
InChI: InChI=1/C21H20Cl2O3/c1-21(2)17(12-18(22)23)19(21)20(24)25-13-14-7-6-10-16(11-14)26-15-8-4-3-5-9-15/h3-12,17,19H,13H2,1-2H3
46 atoms
Cl -0.326218 1.487856 2.822399
Cl -1.463695 -1.119863 2.317249
O  0.836314 2.733552 -1.111076
O  -0.615271 1.05919 -1.401069
O  2.332956 -2.81113 -0.259955
C  -2.818775 3.056334 -0.584189
C  -2.267545 2.524159 0.695911
C  -1.323131 3.097013 -0.360772
C  -3.505696 4.401342 -0.513003
C  -3.44473 2.135588 -1.603415
C  -2.250736 1.081778 1.011131
C  -0.373259 2.17321 -1.0186
C  -1.458229 0.553198 1.93311
C  1.894572 1.899108 -1.585237
C  2.252146 0.836774 -0.584339
C  2.12459 -0.503407 -0.915177
C  2.685144 1.196417 0.687523
C  2.415231 -1.481301 0.027049
C  2.984466 0.214934 1.617275
C  2.843592 -1.126357 1.296746
C  1.255837 -3.314481 -0.928793
C  1.474175 -4.471866 -1.665297
C  -0.014596 -2.755441 -0.856889
C  0.416763 -5.073713 -2.327171
C  -1.060432 -3.366596 -1.532086
C  -0.855579 -4.52334 -2.268568
H  -2.370596 3.166683 1.565439
H  -0.904466 4.068851 -0.127922
H  -4.559732 4.280553 -0.256937
H  -3.057429 5.054199 0.236992
H  -3.452915 4.915212 -1.474133
H  -4.49722 1.98138 -1.357685
H  -3.404622 2.590189 -2.594386
H  -2.963212 1.165525 -1.675052
H  -2.916148 0.413109 0.481101
H  1.634915 1.455506 -2.548736
H  2.727785 2.584341 -1.742358
H  1.76982 -0.78199 -1.899631
H  2.779865 2.241509 0.954374
H  3.316556 0.493057 2.608627
H  3.060719 -1.898512 2.022796
H  2.469593 -4.894363 -1.707987
H  -0.197098 -1.853859 -0.28806
H  0.592498 -5.976531 -2.897272
H  -2.047436 -2.926894 -1.474345
H  -1.678632 -4.992226 -2.79056
totalener: -1958.42186387 hartree
nucrepener: 2707.36168145 hartree
electener: -4665.78354532 hartree
oneelecener: -8068.62687600 hartree
twoeener: 3402.84333069 hartree
kineticenergy: 1952.63179123 hartree
xcener: -143.518423973224 hartree
chargesum: 0.0000000
charge: -0.050992 -0.047805 -0.265569 -0.391938 -0.301606 0.105094 -0.054883 -0.081970 -0.236700 -0.275366 -0.152323 0.354430 0.067410 0.061895 0.041145 -0.147215 -0.243200 0.241875 -0.078584 -0.200974 0.264544 -0.218931 -0.125468 -0.093378 -0.126503 -0.143337 0.101801 0.082074 0.090334 0.074095 0.092846 0.092333 0.088149 0.102539 0.108016 0.100679 0.113875 0.118601 0.111977 0.122299 0.122497 0.121615 0.095289 0.121871 0.118514 0.120942
qa: -0.0510 -0.0478 -0.2656 -0.3919 -0.3016 0.1051 -0.0549 -0.0820 -0.2367 -0.2754 -0.1523 0.3544 0.0674 0.0619 0.0411 -0.1472 -0.2432 0.2419 -0.0786 -0.2010 0.2645 -0.2189 -0.1255 -0.0934 -0.1265 -0.1433 0.1018 0.0821 0.0903 0.0741 0.0928 0.0923 0.0881 0.1025 0.1080 0.1007 0.1139 0.1186 0.1120 0.1223 0.1225 0.1216 0.0953 0.1219 0.1185 0.1209
va: 1.2769 1.2577 2.1317 2.0833 2.1140 3.7669 3.8608 3.8594 3.9007 3.9027 3.8877 4.1485 4.1869 3.8585 3.6120 3.9211 3.9737 3.8410 3.8823 4.0443 3.7985 4.0260 3.9110 3.9390 3.9736 3.9570 1.0120 1.0325 1.0046 1.0072 1.0046 0.9977 1.0047 1.0212 1.0180 1.0104 0.9899 1.0171 1.0190 0.9995 1.0121 1.0155 1.0243 0.9992 1.0023 1.0008
dispcorr: -0.027902846 hartree
energy: -1958.449766712384
dipole: -9.39263 8.89193 -0.50070 9.98163 -8.79941 1.18221 -21.34991 21.05974 -0.29018
magnitude: 1.31626 au
magnitude: 3.34566 debye
