program: Orca
programVersion: 5.0.2
elementType: Cl Cl O O O C C C C C C C C C C C C C C C C C C C C C H H H H H H H H H H H H H H H H H H H H
charge: 0
multiplicity: 1
keywords: wb97x-d3
keywords: def2-TZVPP
keywords: def2/J RIJCOSX
keywords: DEFGRID2
keywords: scfconv7
keywords: smallprint printgap noloewdin
keywords: NOSOSCF
formula: C21H20Cl2O3
InChI: InChI=1/C21H20Cl2O3/c1-21(2)17(12-18(22)23)19(21)20(24)25-13-14-7-6-10-16(11-14)26-15-8-4-3-5-9-15/h3-12,17,19H,13H2,1-2H3
46 atoms
Cl -5.383649 1.996487 0.083212
Cl -4.769761 -0.811603 0.294525
O  1.093703 2.351267 1.426056
O  0.002446 0.530956 0.731157
O  3.756931 -2.376393 -0.603637
C  -1.265239 2.684481 -1.211232
C  -2.283252 2.378661 -0.149665
C  -0.858393 2.721446 0.248575
C  -1.379556 4.026711 -1.89385
C  -0.761806 1.596868 -2.128179
C  -2.860578 1.037296 0.018702
C  0.086629 1.729222 0.8085
C  -4.159788 0.787025 0.11846
C  2.158855 1.531841 1.914071
C  2.944948 0.916868 0.790643
C  2.988765 -0.462122 0.653393
C  3.599307 1.727205 -0.130655
C  3.663214 -1.032619 -0.41813
C  4.28449 1.149684 -1.187426
C  4.313013 -0.226773 -1.342812
C  2.754256 -3.219324 -0.218137
C  1.407496 -2.901459 -0.349932
C  3.139341 -4.460516 0.268865
C  0.452365 -3.834597 0.023428
C  2.1728 -5.387699 0.624622
C  0.825679 -5.078599 0.509765
H  -2.978746 3.185159 0.052851
H  -0.728297 3.714984 0.661709
H  -0.410516 4.353888 -2.274507
H  -2.067322 3.967223 -2.738913
H  -1.750668 4.799805 -1.220004
H  -0.687812 0.621012 -1.657568
H  -1.432485 1.501759 -2.98319
H  0.228448 1.851485 -2.509055
H  -2.19755 0.18582 0.066283
H  2.776393 2.214003 2.498252
H  1.774238 0.762582 2.587011
H  2.467265 -1.084992 1.368662
H  3.569465 2.804635 -0.027146
H  4.79556 1.775717 -1.906846
H  4.835257 -0.682571 -2.173593
H  1.098465 -1.934691 -0.72525
H  4.192258 -4.692322 0.361214
H  -0.595175 -3.581148 -0.071518
H  2.478027 -6.354893 1.00156
H  0.073118 -5.800818 0.795309
totalener: -1958.42476417 hartree
nucrepener: 2539.92302180 hartree
electener: -4498.34778597 hartree
oneelecener: -7733.15365778 hartree
twoeener: 3234.80587182 hartree
kineticenergy: 1952.62477838 hartree
xcener: -143.517268880440 hartree
chargesum: 0.0000000
charge: -0.053028 -0.049082 -0.264675 -0.408065 -0.297858 0.063827 0.048632 -0.085661 -0.235360 -0.234436 -0.226010 0.371616 0.039174 0.057148 0.020317 -0.168777 -0.232698 0.268319 -0.068656 -0.226487 0.274350 -0.179402 -0.222885 -0.111717 -0.087325 -0.147555 0.076991 0.086976 0.089453 0.093190 0.073483 0.080088 0.096268 0.092213 0.132464 0.115231 0.103043 0.122166 0.113896 0.125074 0.124700 0.134831 0.122847 0.125435 0.123573 0.124373
qa: -0.0530 -0.0491 -0.2647 -0.4081 -0.2979 0.0638 0.0486 -0.0857 -0.2354 -0.2344 -0.2260 0.3716 0.0392 0.0571 0.0203 -0.1688 -0.2327 0.2683 -0.0687 -0.2265 0.2744 -0.1794 -0.2229 -0.1117 -0.0873 -0.1476 0.0770 0.0870 0.0895 0.0932 0.0735 0.0801 0.0963 0.0922 0.1325 0.1152 0.1030 0.1222 0.1139 0.1251 0.1247 0.1348 0.1228 0.1254 0.1236 0.1244
va: 1.2761 1.2575 2.1364 2.0757 2.1206 3.7928 3.7916 3.8787 3.9118 3.9187 3.8932 4.1564 4.2375 3.8584 3.6566 3.9175 4.0132 3.8373 3.9090 4.0523 3.7894 3.9436 4.0413 3.9489 3.9276 3.9657 1.0346 1.0296 1.0041 1.0039 1.0086 1.0182 1.0038 1.0035 1.0324 0.9899 1.0102 1.0157 1.0164 0.9985 1.0138 1.0004 1.0154 1.0016 0.9991 1.0005
dispcorr: -0.023591674 hartree
energy: -1958.448355844576
dipole: 28.67370 -28.01767 0.65604 5.30940 -4.35694 0.95246 -8.52543 8.42613 -0.09930
magnitude: 1.16079 au
magnitude: 2.95048 debye
