program: Orca
programVersion: 5.0.2
elementType: Cl Cl O O O C C C C C C C C C C C C C C C C C C C C C H H H H H H H H H H H H H H H H H H H H
charge: 0
multiplicity: 1
keywords: wb97x-d3
keywords: def2-TZVPP
keywords: def2/J RIJCOSX
keywords: DEFGRID2
keywords: scfconv7
keywords: smallprint printgap noloewdin
keywords: NOSOSCF
formula: C21H20Cl2O3
InChI: InChI=1/C21H20Cl2O3/c1-21(2)17(12-18(22)23)19(21)20(24)25-13-14-7-6-10-16(11-14)26-15-8-4-3-5-9-15/h3-12,17,19H,13H2,1-2H3
46 atoms
Cl -5.208493 2.760037 -0.92696
Cl -3.505506 4.994456 -0.286021
O  0.664884 0.036973 -1.987022
O  0.33762 1.868974 -0.754058
O  3.902582 -2.657678 1.135622
C  -1.972827 0.085504 0.427288
C  -2.616574 1.031706 -0.546312
C  -1.399857 0.223084 -0.968727
C  -2.701332 -1.208263 0.703658
C  -1.227655 0.609823 1.629648
C  -2.577669 2.490456 -0.37266
C  -0.069284 0.828246 -1.200185
C  -3.62501 3.293883 -0.511189
C  2.026162 0.417241 -2.190264
C  2.864216 0.156164 -0.97025
C  2.97106 -1.14082 -0.481429
C  3.532621 1.189944 -0.328446
C  3.739728 -1.394483 0.64548
C  4.318679 0.922937 0.782104
C  4.419938 -0.365397 1.280755
C  2.82066 -3.475283 1.275268
C  1.575591 -3.005945 1.67795
C  3.020774 -4.830262 1.05079
C  0.534275 -3.905154 1.849242
C  1.971962 -5.7176 1.233916
C  0.722986 -5.261241 1.628237
H  -3.534888 0.665136 -0.990664
H  -1.614196 -0.604647 -1.634671
H  -3.411619 -1.083637 1.522405
H  -3.256383 -1.561848 -0.165862
H  -1.997032 -1.993723 0.985817
H  -1.92923 0.784575 2.446814
H  -0.499351 -0.128383 1.972431
H  -0.68941 1.535528 1.4498
H  -1.638284 2.959593 -0.117323
H  2.358503 -0.199161 -3.025694
H  2.095827 1.463524 -2.493298
H  2.454384 -1.954044 -0.978161
H  3.429686 2.203984 -0.691323
H  4.841996 1.728967 1.278727
H  5.021373 -0.580619 2.15403
H  1.418913 -1.950874 1.863184
H  3.996937 -5.179394 0.740544
H  -0.432585 -3.538604 2.169589
H  2.134054 -6.773142 1.060444
H  -0.094177 -5.956041 1.766358
totalener: -1958.42480961 hartree
nucrepener: 2526.82673630 hartree
electener: -4485.25154591 hartree
oneelecener: -7706.63153447 hartree
twoeener: 3221.37998856 hartree
kineticenergy: 1952.61534481 hartree
xcener: -143.514170680739 hartree
chargesum: 0.0000000
charge: -0.053508 -0.047091 -0.267297 -0.397619 -0.301030 0.064502 0.047633 -0.075554 -0.225960 -0.247299 -0.231410 0.362342 0.038753 0.063472 0.003062 -0.202549 -0.127174 0.218579 -0.093789 -0.200074 0.236101 -0.156239 -0.205570 -0.117760 -0.088747 -0.155474 0.076995 0.086155 0.093625 0.075561 0.075627 0.097319 0.074811 0.103913 0.131497 0.114432 0.103009 0.123947 0.110872 0.125805 0.127090 0.136193 0.125010 0.127939 0.125191 0.124707
qa: -0.0535 -0.0471 -0.2673 -0.3976 -0.3010 0.0645 0.0476 -0.0756 -0.2260 -0.2473 -0.2314 0.3623 0.0388 0.0635 0.0031 -0.2025 -0.1272 0.2186 -0.0938 -0.2001 0.2361 -0.1562 -0.2056 -0.1178 -0.0887 -0.1555 0.0770 0.0862 0.0936 0.0756 0.0756 0.0973 0.0748 0.1039 0.1315 0.1144 0.1030 0.1239 0.1109 0.1258 0.1271 0.1362 0.1250 0.1279 0.1252 0.1247
va: 1.2751 1.2595 2.1325 2.0882 2.1066 3.7794 3.7947 3.8830 3.9090 3.9147 3.8923 4.1617 4.2431 3.8582 3.6876 3.9508 3.9770 3.8323 3.9438 4.0336 3.8549 3.9233 4.0300 3.9474 3.9433 3.9923 1.0353 1.0302 1.0041 1.0111 1.0159 1.0025 1.0064 1.0193 1.0391 0.9913 1.0112 1.0183 1.0173 0.9994 1.0115 0.9971 1.0142 0.9982 0.9984 1.0015
dispcorr: -0.024071151 hartree
energy: -1958.448880763513
dipole: 19.95369 -19.68785 0.26585 -29.89979 28.82631 -1.07348 9.51144 -9.57154 -0.06010
magnitude: 1.10754 au
magnitude: 2.81515 debye
